{"text_format":"1","workbook":"xlsx","n_sheets":31,"sheets":["مقدمه","وزن مصالح","ديوار تيفه","ديوار محيطي","ديوار نما","ديوار جان پناه","مورب پله","ديوار پله"," كامپوزيت در طبقات"," كامپوزيت در بام","تيرچه بلوك در طبقات ","تيرچه بلوك در بام","کرمیت در طبقات","کرمیت در بام","کرمیت کامپوزیت در طبقات","کرمیت کامپوزیت در بام","دال در طبقات","دال در بام","بار برف","بار زنده","ضريب زلزله X","ضريب زلزله Y","خلاصه","وزن سازه بتنی","وزن سازه فولادی","3 طبقه","4 طبقه","5 طبقه","6 طبقه","7 طبقه","8 طبقه"],"not_rendered":{"charts":0,"images":27,"macros":1,"external_links":0,"defined_names":29,"comments":1,"pivot_tables":0},"unopened":[],"bounds":{"document_bytes":16777216,"sheet_cells":100000,"rows_first":2000,"rows_last":500,"rows_between":2000,"halvings":0,"cell_chars":16384,"cell_head_chars":4096},"cells_cut":0,"cells_raw":0,"read":"whole","date_system":"1900"}

{"sheet":"مقدمه","index":0,"n_rows":21,"n_cols":3,"rows_kept":21,"cut":false,"hidden":false,"merged":[[18,2,18,11],[19,2,19,11],[20,2,20,11],[22,2,24,11],[5,4,7,11],[15,2,16,11],[12,2,12,11],[9,2,11,11],[17,2,17,11]]}
[]
[]
[]
[]
[]
[]
[]
[]
[]
[null,null,"چند نكته"]
[]
[]
[null,null,"1-براي گرفتن پرينت بايد ماكروها رافعال كنيد براي اين منظور در قسنت Secutity Warning گزينه Enable This Content  را تيك بزنيد. "]
[]
[]
[null,null,"2-در مجاسبه وزن اجزا و مصالح از منابع مختلف كمك گرفته شده است و انچه كه متداول بوده است مورد استفاده قرار گرفته است به عنوان مثال در محاسبه وزن طبقات از وزن تاسيسات احتمالي صرف نظر شده است و يا در سقف تيرچه بلوك وزن چاله بتني اطراف تيرچه را ميتوان در مورد مساحت خود تيرچه لحاظ كرد."]
[]
[null,null,"3-فايل اتوكد جزييات بر روي سايت قرار خواهد گرفت تا در صورت تغيير دادن اجزاء مصرفي قابل ويرايش باشد."]
[null,null,"4-استفاده از اين نرم افزار با ذكر نام منبع بلا مانع است."]
[null,null,"5-وزن اجزاء و مصالح از مبحث ششم گرفته شده است."]
[null,null,"6-هرگونه ايراد و اشكال را به ايميل زير بفرستيد:                                                                    Email:xenonfxfactory@gmail.com   "]

{"sheet":"وزن مصالح","index":1,"n_rows":44,"n_cols":13,"rows_kept":44,"cut":false,"hidden":true,"merged":[[27,7,27,8],[2,1,2,2],[12,1,12,2],[22,1,22,2],[2,10,2,11],[2,4,2,5],[13,4,13,5],[2,7,2,8],[23,4,23,5]]}
[]
[]
[null,"بنايي با آجر و بلوك",null,null,"بتن ها",null,null,"سنگ ها و پركننده ها",null,null,"سنگ هاي طبيعي و نما"]
[null,"آجر كاري با آجر فشاري و ملات ماسه سيمان",1850,1,"بتن با شن و ماسه معمولي",2400,1,"شن خيس",2000,1,"گرانيت",2800,1]
[null,"آجر كاري با آجر فشاري و ملات ماسه آهك",1800,2,"بتن آرمه",2500,2,"شن خشك",1700,2,"آلومينيوم",2700,2]
[null,"آجر كاري با آجر فشاري و ملات گچ و خاك(طاق ضربي)",1750,3,"بتن با سرباره كوره آهن گدازي",1750,3,"ماسه خيس",1800,3,"ديوريت - گابرو",3000,3]
[null,"آجر كاري با آجر سفال و ملات ماسه سيمان ",2100,4,"بتن هاي سبك هوادار",600,4,"ماسه خشك",1550,4,"بازالت ملافير",3000,4]
[null,"آجر كاري با آجر سفال و ملات ماسه آهك",2000,5,"بتن با سنگ دانه سبك","1000-1800",5,"ماسه بادي",1600,5,"كفسنگ (توف)",2000,5]
[null,"آجركاري با آجر مجوف و ملات ماسه سيمان",850,6,"بتن اسفنجي","500-900",6,"خاك-ماسه-گل رس خيس",2100,6,"سنگهاي آذرين ماگماتيك",2800,6]
[null,"آجر كاري باآجر نسوز و ملات نسوز",2000,7,"بتن با خرده آجر",1700,7,"خاك-ماسه-گل رس مرطوب (5% رطوبت)",1800,7,"سنگهاي آتشفشاني",2800,7]
[null,"آجر كاري باآجر ضد اسيد و ملات قيري",1900,8,"بتن با پوكه معدني و سيمان",1300,8,"بتن سبك با پوكه معدني و ملات سيمان",1300,8,"توف آتشفشاني",1600,8]
[null,null,null,null,"بتن با پوكه صنعتي و سيمان","1000-1800",9,"لاشه سنگ",1400,9,"تراورتن",2500,9]
[null,"ملات ها",null,null,null,null,null,"سرباره كوره آهن گدازي",1500,10,"گنايس",2800,10]
[null,"ملات ماسه آهك",1850,1,"بنايي با سنگهاي طبيعي و ملات ماسه سيمان",null,null,"سرباره كوره آهن گدازي دانه به دانه",1000,11,"شيست",2800,11]
[null,"ملات ماسه سيمان و آهك (باتارد)",2000,2,"گرانيت و پورفيت",2800,1,"پوزولان ها",1000,12,"ماسه سنگ",2700,12]
[null,"ملات ماسه سيمان",2100,3,"لاشه آذرين (تراشيت)",2600,2,"پوكه معدني",600,13,"مارل",2300,13]
[null,"ملات گچ",1300,4,"ماسه سنگ",2300,3,"پوكه كك",700,14,"سنگ آهك متخلخل",2000,14]
[null,"ملات خاك نسوز",1900,5,"سنگ آهكي فشرده (دولوميت مرمر گل سنگ آهكي)",2700,4,"جوش زغال",1000,15,"سنگ آهك ابي",2400,15]
[null,"كاهگل",1600,6,"تراورتن",2400,5,"ذغال سنگ",800,16,"سنگ آهك سخت",2700,16]
[null,"ملات گچ و خاك",1600,7,"اسليت (تخته سنگ)",2800,6,"ذغال چوب (از چوب نرم و سبك)",150,17,"دولوميت",2800,17]
[null,"ملات گل",2000,8,"سنگ چيني با سنگ هاي لاشه آهكي مرمر",2500,7,"ذغال چوب (از چوب سفت و سنگين)",220,18,"سنگ مرمر",2700,18]
[null,null,null,null,"سنگ چيني با سنگ توف",2000,8,"خرده آجر",1500,19,"تخته سنگ هاي رسي",2600,19]
[null,"پوشش هاي سقف",null,null,null,null,null,"سنگ آهك پخته",700,20]
[null,"پوشش شيرواني با سفال",70,1,"پوشش ها و مواد متفرقه ساختماني",null,null,"خاكستر كك",700,21]
[null,"گوني قيراندود يك لا",10,2,"آسفالت",2200,1,"پودر سيمان توده شده و بطور آزاد",1300,22]
[null,"گوني قيراندود دو لا",15,3,"قير",1200,2,"پودر سيمان در كيسه و جابجا شده",1800,23]
[null,"سقف كاذب با اندود سيماني",75,4,"تخته هاي سقف پوش آزبستي (آردواز)",2000,3]
[null,"سقف كاذب با اندود گچي",50,5,"ورق هاي موجدار آزبست",1600,4,"آجر ها و بلوك هاي ساختماني"]
[null,"آسفالت",2200,6,"لوله هاي سيمان آزبست",1800,5,"آجر توپر پخته رسي معمولي (آجر فشاري)",1700,1]
[null,null,null,null,"موزاييك سيماني",2250,6,"آجر سوراخدار پخته رسي (آجر سفال)",1300,2]
[null,null,null,null,"سنگ موزاييك",2400,7,"آجر ماسه آهكي متخلخل",1450,3]
[null,null,null,null,"آجر فرش با آجر سوراخدار",1350,8,"آجر ماسه آهكي توپر",1800,4]
[null,null,null,null,"آجر فرش با آجر توپر",1600,9,"آجر نسوز",1850,5]
[null,null,null,null,"رزين اپوكسي بدون فيلر (افزودني)",1150,10,"آجر ضد اسيد",2000,6]
[null,null,null,null,"رزين با مواد معدني",2000,11,"آجر شيشه اي مجوف",1250,7]
[null,null,null,null,"رزين با فايبر گلاس",1800,12,"آجر مجوف",600,8]
[null,null,null,null,"كف پوش لاستيكي",1800,13,"بلوك سيماني","900-300",9]
[null,null,null,null,"ورق پي وي سي",1400,14]
[null,null,null,null,"كف پوش پي وي سي",1700,15]
[null,null,null,null,"صفحات گچ و پرليت جهت سقف كاذب",850,16]
[null,null,null,null,"شيشه جام",2500,17]
[null,null,null,null,"شيشه مسلح",3000,18]
[null,null,null,null,"كاشي سراميكي ديواري",1700,19]
[null,null,null,null,"كاشي سراميكي كفي",2100,20]

{"sheet":"ديوار تيفه","index":2,"n_rows":40,"n_cols":7,"rows_kept":40,"cut":false,"hidden":false,"merged":[[19,2,19,6],[24,2,24,3],[24,4,24,6],[27,2,29,6]]}
[]
[]
[]
[]
[]
[]
[]
[]
[]
[]
[]
[]
[]
[]
[]
[]
[]
[]
[]
[null,null,"وزن واحد سطح ديوارهاي جدا كننده (تيغه ها):"]
[null,null,"مصالح مصرفي","وزن مخصوص (kg/m3)","ضخامت(m)","تعداد","شدت بار(kg/m2)"]
[6,null,{"$f":"CHOOSE(A22,'وزن مصالح'!B4,'وزن مصالح'!B5,'وزن مصالح'!B6,'وزن مصالح'!B7,'وزن مصالح'!B8,'وزن مصالح'!B9,'وزن مصالح'!B10,'وزن مصالح'!B11)","v":"آجركاري با آجر مجوف و ملات ماسه سيمان"},{"$f":"CHOOSE(A22,'وزن مصالح'!C4,'وزن مصالح'!C5,'وزن مصالح'!C6,'وزن مصالح'!C7,'وزن مصالح'!C8,'وزن مصالح'!C9,'وزن مصالح'!C10,'وزن مصالح'!C11)","v":850},0.1,1,{"$f":"D22*E22*F22","v":85}]
[7,null,{"$f":"CHOOSE(A23,'وزن مصالح'!B14,'وزن مصالح'!B15,'وزن مصالح'!B16,'وزن مصالح'!B17,'وزن مصالح'!B18,'وزن مصالح'!B19,'وزن مصالح'!B20,'وزن مصالح'!B21)","v":"ملات گچ و خاك"},{"$f":"CHOOSE(A23,'وزن مصالح'!C14,'وزن مصالح'!C15,'وزن مصالح'!C16,'وزن مصالح'!C17,'وزن مصالح'!C18,'وزن مصالح'!C19,'وزن مصالح'!C20,'وزن مصالح'!C21)","v":1600},0.02,2,{"$f":"F23*E23*D23","v":64}]
[4,null,{"$f":"CHOOSE(A24,'وزن مصالح'!B14,'وزن مصالح'!B15,'وزن مصالح'!B16,'وزن مصالح'!B17,'وزن مصالح'!B18,'وزن مصالح'!B19,'وزن مصالح'!B20,'وزن مصالح'!B21)","v":"ملات گچ"},{"$f":"CHOOSE(A24,'وزن مصالح'!C14,'وزن مصالح'!C15,'وزن مصالح'!C16,'وزن مصالح'!C17,'وزن مصالح'!C18,'وزن مصالح'!C19,'وزن مصالح'!C20,'وزن مصالح'!C21)","v":1300},0.01,2,26]
[null,null,"حاصل جمع",null,{"$f":"G24+G23+G22","v":175}]
[]
[]
[null,null,"با توجه به مبحث ششم در صورتي كه وزن يك متر مربع سطح تيغه هاي داخلي از 275 كيلوگرم كمتر باشد ميتوان بار تيغه ها را به صورت معادل يكنواخت به بار مرده سقف افزود.كه از 100 كيلوگرم نبايد كمتر باشد."]
[]
[]
[]
[]
[null,null,"w=وزن هر متر مربع تيغه",{"$f":"E25","v":175}]
[null,null,"h=ارتفاع طبقه",2.9]
[null,null,"l=طول كل تيغه ها",25]
[null,null,"A=مساحت كل طبقه",155]
[]
[null,null,null,null,null,{"$f":"D33*D34*D35/D36","v":81.854838709677423}]
[]
[null,null,null,null,null,{"$f":"MAX(CEILING(D33*D34*D35/D36,5),100)","v":100}]

{"sheet":"ديوار محيطي","index":3,"n_rows":34,"n_cols":7,"rows_kept":34,"cut":false,"hidden":false,"merged":[[19,2,19,6],[25,2,25,3],[25,4,25,6]]}
[]
[]
[]
[]
[]
[]
[]
[]
[]
[]
[]
[]
[]
[]
[]
[]
[]
[]
[]
[null,null,"وزن واحد سطح ديوارهاي محيطي مجاور همسايه:"]
[null,null,"مصالح مصرفي","وزن مخصوص (kg/m3)","ضخامت(m)","تعداد","شدت بار(kg/m2)"]
[6,null,{"$f":"CHOOSE(A22,'وزن مصالح'!B4,'وزن مصالح'!B5,'وزن مصالح'!B6,'وزن مصالح'!B7,'وزن مصالح'!B8,'وزن مصالح'!B9,'وزن مصالح'!B10,'وزن مصالح'!B11)","v":"آجركاري با آجر مجوف و ملات ماسه سيمان"},{"$f":"CHOOSE(A22,'وزن مصالح'!C4,'وزن مصالح'!C5,'وزن مصالح'!C6,'وزن مصالح'!C7,'وزن مصالح'!C8,'وزن مصالح'!C9,'وزن مصالح'!C10,'وزن مصالح'!C11)","v":850},0.2,1,{"$f":"D22*E22*F22","v":170}]
[7,null,{"$f":"CHOOSE(A23,'وزن مصالح'!B14,'وزن مصالح'!B15,'وزن مصالح'!B16,'وزن مصالح'!B17,'وزن مصالح'!B18,'وزن مصالح'!B19,'وزن مصالح'!B20,'وزن مصالح'!B21)","v":"ملات گچ و خاك"},{"$f":"CHOOSE(A23,'وزن مصالح'!C14,'وزن مصالح'!C15,'وزن مصالح'!C16,'وزن مصالح'!C17,'وزن مصالح'!C18,'وزن مصالح'!C19,'وزن مصالح'!C20,'وزن مصالح'!C21)","v":1600},0.02,1,{"$f":"F23*E23*D23","v":32}]
[4,null,{"$f":"CHOOSE(A24,'وزن مصالح'!B14,'وزن مصالح'!B15,'وزن مصالح'!B16,'وزن مصالح'!B17,'وزن مصالح'!B18,'وزن مصالح'!B19,'وزن مصالح'!B20,'وزن مصالح'!B21)","v":"ملات گچ"},{"$f":"CHOOSE(A24,'وزن مصالح'!C14,'وزن مصالح'!C15,'وزن مصالح'!C16,'وزن مصالح'!C17,'وزن مصالح'!C18,'وزن مصالح'!C19,'وزن مصالح'!C20,'وزن مصالح'!C21)","v":1300},0.01,1,13]
[3,null,{"$f":"CHOOSE(A25,'وزن مصالح'!B14,'وزن مصالح'!B15,'وزن مصالح'!B16,'وزن مصالح'!B17,'وزن مصالح'!B18,'وزن مصالح'!B19,'وزن مصالح'!B20,'وزن مصالح'!B21)","v":"ملات ماسه سيمان"},{"$f":"CHOOSE(A25,'وزن مصالح'!C14,'وزن مصالح'!C15,'وزن مصالح'!C16,'وزن مصالح'!C17,'وزن مصالح'!C18,'وزن مصالح'!C19,'وزن مصالح'!C20,'وزن مصالح'!C21)","v":2100},0.02,1,{"$f":"F25*E25*D25","v":42}]
[null,null,"حاصل جمع",null,{"$f":"G24+G23+G22+G25","v":257}]
[]
[]
[null,null,null,null,null,null,"محاسبه وزن واحد طول ديوار:"]
[]
[]
[null,null,null,3]
[]
[null,null,null,{"$f":"CEILING(E26*D32,5)","v":775}]

{"sheet":"ديوار نما","index":4,"n_rows":38,"n_cols":7,"rows_kept":38,"cut":false,"hidden":false,"merged":[[19,2,19,6],[26,2,26,3],[26,4,26,6]]}
[]
[]
[]
[]
[]
[]
[]
[]
[]
[]
[]
[]
[]
[]
[]
[]
[]
[]
[]
[null,null,"وزن واحد سطح ديوارهاي محيطي (نماي ساختمان):"]
["dsdsdfgfg",null,"مصالح مصرفي","وزن مخصوص (kg/m3)","ضخامت(m)","تعداد","شدت بار(kg/m2)"]
[6,null,{"$f":"CHOOSE(A22,'وزن مصالح'!B4,'وزن مصالح'!B5,'وزن مصالح'!B6,'وزن مصالح'!B7,'وزن مصالح'!B8,'وزن مصالح'!B9,'وزن مصالح'!B10,'وزن مصالح'!B11)","v":"آجركاري با آجر مجوف و ملات ماسه سيمان"},{"$f":"CHOOSE(A22,'وزن مصالح'!C4,'وزن مصالح'!C5,'وزن مصالح'!C6,'وزن مصالح'!C7,'وزن مصالح'!C8,'وزن مصالح'!C9,'وزن مصالح'!C10,'وزن مصالح'!C11)","v":850},0.2,1,{"$f":"D22*E22*F22","v":170}]
[7,null,{"$f":"CHOOSE(A23,'وزن مصالح'!B14,'وزن مصالح'!B15,'وزن مصالح'!B16,'وزن مصالح'!B17,'وزن مصالح'!B18,'وزن مصالح'!B19,'وزن مصالح'!B20,'وزن مصالح'!B21)","v":"ملات گچ و خاك"},{"$f":"CHOOSE(A23,'وزن مصالح'!C14,'وزن مصالح'!C15,'وزن مصالح'!C16,'وزن مصالح'!C17,'وزن مصالح'!C18,'وزن مصالح'!C19,'وزن مصالح'!C20,'وزن مصالح'!C21)","v":1600},0.02,1,{"$f":"D23*E23*F23","v":32}]
[4,null,{"$f":"CHOOSE(A24,'وزن مصالح'!B14,'وزن مصالح'!B15,'وزن مصالح'!B16,'وزن مصالح'!B17,'وزن مصالح'!B18,'وزن مصالح'!B19,'وزن مصالح'!B20,'وزن مصالح'!B21)","v":"ملات گچ"},{"$f":"CHOOSE(A24,'وزن مصالح'!C14,'وزن مصالح'!C15,'وزن مصالح'!C16,'وزن مصالح'!C17,'وزن مصالح'!C18,'وزن مصالح'!C19,'وزن مصالح'!C20,'وزن مصالح'!C21)","v":1300},0.01,1,13]
[3,null,{"$f":"CHOOSE(A25,'وزن مصالح'!B14,'وزن مصالح'!B15,'وزن مصالح'!B16,'وزن مصالح'!B17,'وزن مصالح'!B18,'وزن مصالح'!B19,'وزن مصالح'!B20,'وزن مصالح'!B21)","v":"ملات ماسه سيمان"},{"$f":"CHOOSE(A25,'وزن مصالح'!C14,'وزن مصالح'!C15,'وزن مصالح'!C16,'وزن مصالح'!C17,'وزن مصالح'!C18,'وزن مصالح'!C19,'وزن مصالح'!C20,'وزن مصالح'!C21)","v":2100},0.02,1,42]
[18,null,{"$f":"CHOOSE(A26,'وزن مصالح'!K4,'وزن مصالح'!K5,'وزن مصالح'!K6,'وزن مصالح'!K7,'وزن مصالح'!K8,'وزن مصالح'!K9,'وزن مصالح'!K10,'وزن مصالح'!K11,'وزن مصالح'!K12,'وزن مصالح'!K13,'وزن مصالح'!K14,'وزن مصالح'!K15,'وزن مصالح'!K16,'وزن مصالح'!K17,'وزن مصالح'!K18,'وزن مصالح'!K19,'وزن مصالح'!K20,'وزن مصالح'!K21,'وزن مصالح'!K22)","v":"سنگ مرمر"},{"$f":"CHOOSE(A26,'وزن مصالح'!L4,'وزن مصالح'!L5,'وزن مصالح'!L6,'وزن مصالح'!L7,'وزن مصالح'!L8,'وزن مصالح'!L9,'وزن مصالح'!L10,'وزن مصالح'!L11,'وزن مصالح'!L12,'وزن مصالح'!L13,'وزن مصالح'!L14,'وزن مصالح'!L15,'وزن مصالح'!L16,'وزن مصالح'!L17,'وزن مصالح'!L18,'وزن مصالح'!L19,'وزن مصالح'!L20,'وزن مصالح'!L21,'وزن مصالح'!L22)","v":2700},0.02,1,54]
[null,null,"حاصل جمع",null,{"$f":"SUM(G22:G26)","v":311}]
[]
[]
[null,null,null,null,null,null,"محاسبه وزن واحد طول ديوار:"]
[]
[null,null,null,3]
[]
[null,null,null,{"$f":"D32*E27","v":933}]
[]
[null,null,null,0.3]
[]
[null,null,null,{"$f":"CEILING(D34*(1-D36),5)","v":655}]

{"sheet":"ديوار جان پناه","index":5,"n_rows":34,"n_cols":7,"rows_kept":34,"cut":false,"hidden":false,"merged":[[19,2,19,6],[25,2,25,3],[25,4,25,6]]}
[]
[]
[]
[]
[]
[]
[]
[]
[]
[]
[]
[]
[]
[]
[]
[]
[]
[]
[]
[null,null,"وزن واحد سطح ديوار هاي جان پناه پشت بام:"]
[null,null,"مصالح مصرفي","وزن مخصوص (kg/m3)","ضخامت(m)","تعداد","شدت بار(kg/m2)"]
[6,null,{"$f":"CHOOSE(A22,'وزن مصالح'!B4,'وزن مصالح'!B5,'وزن مصالح'!B6,'وزن مصالح'!B7,'وزن مصالح'!B8,'وزن مصالح'!B9,'وزن مصالح'!B10,'وزن مصالح'!B11)","v":"آجركاري با آجر مجوف و ملات ماسه سيمان"},{"$f":"CHOOSE(A22,'وزن مصالح'!C4,'وزن مصالح'!C5,'وزن مصالح'!C6,'وزن مصالح'!C7,'وزن مصالح'!C8,'وزن مصالح'!C9,'وزن مصالح'!C10,'وزن مصالح'!C11)","v":850},0.2,1,{"$f":"D22*E22*F22","v":170}]
[3,null,{"$f":"CHOOSE(A23,'وزن مصالح'!B14,'وزن مصالح'!B15,'وزن مصالح'!B16,'وزن مصالح'!B17,'وزن مصالح'!B18,'وزن مصالح'!B19,'وزن مصالح'!B20,'وزن مصالح'!B21)","v":"ملات ماسه سيمان"},{"$f":"CHOOSE(A23,'وزن مصالح'!C14,'وزن مصالح'!C15,'وزن مصالح'!C16,'وزن مصالح'!C17,'وزن مصالح'!C18,'وزن مصالح'!C19,'وزن مصالح'!C20,'وزن مصالح'!C21)","v":2100},0.03,1,{"$f":"D23*E23*F23","v":63}]
[3,null,{"$f":"CHOOSE(A24,'وزن مصالح'!B14,'وزن مصالح'!B15,'وزن مصالح'!B16,'وزن مصالح'!B17,'وزن مصالح'!B18,'وزن مصالح'!B19,'وزن مصالح'!B20,'وزن مصالح'!B21)","v":"ملات ماسه سيمان"},{"$f":"CHOOSE(A24,'وزن مصالح'!C14,'وزن مصالح'!C15,'وزن مصالح'!C16,'وزن مصالح'!C17,'وزن مصالح'!C18,'وزن مصالح'!C19,'وزن مصالح'!C20,'وزن مصالح'!C21)","v":2100},0.02,1,42]
[18,null,{"$f":"CHOOSE(A25,'وزن مصالح'!K4,'وزن مصالح'!K5,'وزن مصالح'!K6,'وزن مصالح'!K7,'وزن مصالح'!K8,'وزن مصالح'!K9,'وزن مصالح'!K10,'وزن مصالح'!K11,'وزن مصالح'!K12,'وزن مصالح'!K13,'وزن مصالح'!K14,'وزن مصالح'!K15,'وزن مصالح'!K16,'وزن مصالح'!K17,'وزن مصالح'!K18,'وزن مصالح'!K19,'وزن مصالح'!K20,'وزن مصالح'!K21,'وزن مصالح'!K22)","v":"سنگ مرمر"},{"$f":"CHOOSE(A25,'وزن مصالح'!L4,'وزن مصالح'!L5,'وزن مصالح'!L6,'وزن مصالح'!L7,'وزن مصالح'!L8,'وزن مصالح'!L9,'وزن مصالح'!L10,'وزن مصالح'!L11,'وزن مصالح'!L12,'وزن مصالح'!L13,'وزن مصالح'!L14,'وزن مصالح'!L15,'وزن مصالح'!L16,'وزن مصالح'!L17,'وزن مصالح'!L18,'وزن مصالح'!L19,'وزن مصالح'!L20,'وزن مصالح'!L21,'وزن مصالح'!L22)","v":2700},0.02,1,54]
[null,null,"حاصل جمع",null,{"$f":"SUM(G22:G25)","v":329}]
[]
[]
[null,null,null,null,null,null,"محاسبه وزن واحد طول ديوار:"]
[]
[]
[null,null,null,0.8]
[]
[null,null,null,{"$f":"CEILING(E26*D32,5)","v":265}]

{"sheet":"مورب پله","index":6,"n_rows":28,"n_cols":7,"rows_kept":28,"cut":false,"hidden":false,"merged":[[19,2,19,6],[27,2,27,3],[27,4,27,6]]}
[]
[]
[]
[]
[]
[]
[]
[]
[]
[]
[]
[{"$f":"RADIANS(A14)","v":0.52359877559829882}]
["زاويه قسمت مورب پله با افق"]
[30]
["ارتفاع پيشاني پله"]
[0.15]
["عرض كف پله"]
[0.3]
[]
[null,null,"وزن واحد سطح قسمت مورب پله:"]
[null,null,"مصالح مصرفي","وزن مخصوص (kg/m3)","ضخامت(m)","تعداد","شدت بار(kg/m2)"]
[18,null,{"$f":"CHOOSE(A22,'وزن مصالح'!K4,'وزن مصالح'!K5,'وزن مصالح'!K6,'وزن مصالح'!K7,'وزن مصالح'!K8,'وزن مصالح'!K9,'وزن مصالح'!K10,'وزن مصالح'!K11,'وزن مصالح'!K12,'وزن مصالح'!K13,'وزن مصالح'!K14,'وزن مصالح'!K15,'وزن مصالح'!K16,'وزن مصالح'!K17,'وزن مصالح'!K18,'وزن مصالح'!K19,'وزن مصالح'!K20,'وزن مصالح'!K21,'وزن مصالح'!K22)","v":"سنگ مرمر"},{"$f":"CHOOSE(A22,'وزن مصالح'!L4,'وزن مصالح'!L5,'وزن مصالح'!L6,'وزن مصالح'!L7,'وزن مصالح'!L8,'وزن مصالح'!L9,'وزن مصالح'!L10,'وزن مصالح'!L11,'وزن مصالح'!L12,'وزن مصالح'!L13,'وزن مصالح'!L14,'وزن مصالح'!L15,'وزن مصالح'!L16,'وزن مصالح'!L17,'وزن مصالح'!L18,'وزن مصالح'!L19,'وزن مصالح'!L20,'وزن مصالح'!L21,'وزن مصالح'!L22)","v":2700},0.03,1,{"$f":"D22*E22*F22","v":81}]
[9,null,{"$f":"CHOOSE(A23,'وزن مصالح'!K4,'وزن مصالح'!K5,'وزن مصالح'!K6,'وزن مصالح'!K7,'وزن مصالح'!K8,'وزن مصالح'!K9,'وزن مصالح'!K10,'وزن مصالح'!K11,'وزن مصالح'!K12,'وزن مصالح'!K13,'وزن مصالح'!K14,'وزن مصالح'!K15,'وزن مصالح'!K16,'وزن مصالح'!K17,'وزن مصالح'!K18,'وزن مصالح'!K19,'وزن مصالح'!K20,'وزن مصالح'!K21,'وزن مصالح'!K22)","v":"تراورتن"},{"$f":"CHOOSE(A23,'وزن مصالح'!L4,'وزن مصالح'!L5,'وزن مصالح'!L6,'وزن مصالح'!L7,'وزن مصالح'!L8,'وزن مصالح'!L9,'وزن مصالح'!L10,'وزن مصالح'!L11,'وزن مصالح'!L12,'وزن مصالح'!L13,'وزن مصالح'!L14,'وزن مصالح'!L15,'وزن مصالح'!L16,'وزن مصالح'!L17,'وزن مصالح'!L18,'وزن مصالح'!L19,'وزن مصالح'!L20,'وزن مصالح'!L21,'وزن مصالح'!L22)","v":2500},{"$f":"A16*0.02","v":3.0000000000000001E-3},{"$f":"ROUND((1/A18),1)","v":3.3},{"$f":"ROUND(D23*E23*F23,0)","v":25}]
[8,null,{"$f":"CHOOSE(A24,'وزن مصالح'!H4,'وزن مصالح'!H5,'وزن مصالح'!H6,'وزن مصالح'!H7,'وزن مصالح'!H8,'وزن مصالح'!H9,'وزن مصالح'!H10,'وزن مصالح'!H11,'وزن مصالح'!H12,'وزن مصالح'!H13,'وزن مصالح'!H14,'وزن مصالح'!H15,'وزن مصالح'!H16,'وزن مصالح'!H17,'وزن مصالح'!H18,'وزن مصالح'!H19,'وزن مصالح'!H20,'وزن مصالح'!H21,'وزن مصالح'!H22,'وزن مصالح'!H23,'وزن مصالح'!H24,'وزن مصالح'!H25,'وزن مصالح'!H26)","v":"بتن سبك با پوكه معدني و ملات سيمان"},{"$f":"CHOOSE(A24,'وزن مصالح'!I4,'وزن مصالح'!I5,'وزن مصالح'!I6,'وزن مصالح'!I7,'وزن مصالح'!I8,'وزن مصالح'!I9,'وزن مصالح'!I10,'وزن مصالح'!I11,'وزن مصالح'!I12,'وزن مصالح'!I13,'وزن مصالح'!I14,'وزن مصالح'!I15,'وزن مصالح'!I16,'وزن مصالح'!I17,'وزن مصالح'!I18,'وزن مصالح'!I19,'وزن مصالح'!I20,'وزن مصالح'!I21,'وزن مصالح'!I22,'وزن مصالح'!I23,'وزن مصالح'!I24,'وزن مصالح'!I25,'وزن مصالح'!I26)","v":1300},{"$f":"(A16*A18/2)","v":2.2499999999999999E-2},{"$f":"ROUND((1/A18),1)","v":3.3},{"$f":"ROUND(D24*E24*F24,0)","v":97}]
[2,null,{"$f":"CHOOSE(A25,'وزن مصالح'!E4,'وزن مصالح'!E5,'وزن مصالح'!E6,'وزن مصالح'!E7,'وزن مصالح'!E8,'وزن مصالح'!E9,'وزن مصالح'!E10,'وزن مصالح'!E11,'وزن مصالح'!E12)","v":"بتن آرمه"},{"$f":"CHOOSE(A25,'وزن مصالح'!F4,'وزن مصالح'!F5,'وزن مصالح'!F6,'وزن مصالح'!F7,'وزن مصالح'!F8,'وزن مصالح'!F9,'وزن مصالح'!F10,'وزن مصالح'!F11,'وزن مصالح'!F12)","v":2500},0.15,"1/COS(α)",{"$f":"ROUND(D25*E25*(1/COS(A12)),0)","v":433}]
[7,null,{"$f":"CHOOSE(A26,'وزن مصالح'!B14,'وزن مصالح'!B15,'وزن مصالح'!B16,'وزن مصالح'!B17,'وزن مصالح'!B18,'وزن مصالح'!B19,'وزن مصالح'!B20,'وزن مصالح'!B21)","v":"ملات گچ و خاك"},{"$f":"CHOOSE(A26,'وزن مصالح'!C14,'وزن مصالح'!C15,'وزن مصالح'!C16,'وزن مصالح'!C17,'وزن مصالح'!C18,'وزن مصالح'!C19,'وزن مصالح'!C20,'وزن مصالح'!C21)","v":1600},0.02,"1/COS(α)",{"$f":"ROUND(D26*E26*(1/COS(A12)),0)","v":37}]
[4,null,{"$f":"CHOOSE(A27,'وزن مصالح'!B14,'وزن مصالح'!B15,'وزن مصالح'!B16,'وزن مصالح'!B17,'وزن مصالح'!B18,'وزن مصالح'!B19,'وزن مصالح'!B20,'وزن مصالح'!B21)","v":"ملات گچ"},{"$f":"CHOOSE(A27,'وزن مصالح'!C14,'وزن مصالح'!C15,'وزن مصالح'!C16,'وزن مصالح'!C17,'وزن مصالح'!C18,'وزن مصالح'!C19,'وزن مصالح'!C20,'وزن مصالح'!C21)","v":1300},0.01,"1/COS(α)",{"$f":"ROUND(D27*E27*(1/COS(A12)),0)","v":15}]
[null,null,"حاصل جمع",null,{"$f":"CEILING(SUM(G22:G27),5)","v":690}]

{"sheet":"ديوار پله","index":7,"n_rows":34,"n_cols":7,"rows_kept":34,"cut":false,"hidden":false,"merged":[[19,2,19,6],[24,2,24,3],[24,4,24,6]]}
[]
[]
[]
[]
[]
[]
[]
[]
[]
[]
[]
[]
[]
[]
[]
[]
[]
[]
[]
[null,null,"وزن واحد سطح ديوارهاي پله :"]
[null,null,"مصالح مصرفي","وزن مخصوص (kg/m3)","ضخامت(m)","تعداد","شدت بار(kg/m2)"]
[6,null,{"$f":"CHOOSE(A22,'وزن مصالح'!B4,'وزن مصالح'!B5,'وزن مصالح'!B6,'وزن مصالح'!B7,'وزن مصالح'!B8,'وزن مصالح'!B9,'وزن مصالح'!B10,'وزن مصالح'!B11)","v":"آجركاري با آجر مجوف و ملات ماسه سيمان"},{"$f":"CHOOSE(A22,'وزن مصالح'!C4,'وزن مصالح'!C5,'وزن مصالح'!C6,'وزن مصالح'!C7,'وزن مصالح'!C8,'وزن مصالح'!C9,'وزن مصالح'!C10,'وزن مصالح'!C11)","v":850},0.2,1,{"$f":"D22*E22*F22","v":170}]
[7,null,{"$f":"CHOOSE(A23,'وزن مصالح'!B14,'وزن مصالح'!B15,'وزن مصالح'!B16,'وزن مصالح'!B17,'وزن مصالح'!B18,'وزن مصالح'!B19,'وزن مصالح'!B20,'وزن مصالح'!B21)","v":"ملات گچ و خاك"},{"$f":"CHOOSE(A23,'وزن مصالح'!C14,'وزن مصالح'!C15,'وزن مصالح'!C16,'وزن مصالح'!C17,'وزن مصالح'!C18,'وزن مصالح'!C19,'وزن مصالح'!C20,'وزن مصالح'!C21)","v":1600},0.02,2,{"$f":"F23*E23*D23","v":64}]
[4,null,{"$f":"CHOOSE(A24,'وزن مصالح'!B14,'وزن مصالح'!B15,'وزن مصالح'!B16,'وزن مصالح'!B17,'وزن مصالح'!B18,'وزن مصالح'!B19,'وزن مصالح'!B20,'وزن مصالح'!B21)","v":"ملات گچ"},{"$f":"CHOOSE(A24,'وزن مصالح'!C14,'وزن مصالح'!C15,'وزن مصالح'!C16,'وزن مصالح'!C17,'وزن مصالح'!C18,'وزن مصالح'!C19,'وزن مصالح'!C20,'وزن مصالح'!C21)","v":1300},0.01,2,26]
[null,null,"حاصل جمع",null,{"$f":"G22+G23+G24","v":260}]
[]
[]
[]
[null,null,null,null,null,null,"محاسبه وزن واحد طول ديوار:"]
[]
[]
[null,null,null,3]
[]
[null,null,null,{"$f":"CEILING(E25*D32,5)","v":780}]

{"sheet":" كامپوزيت در طبقات","index":8,"n_rows":34,"n_cols":7,"rows_kept":34,"cut":false,"hidden":false,"merged":[[16,2,16,6],[24,2,24,3],[24,4,24,6],[33,2,34,2],[33,3,34,3]]}
[]
[]
[]
[]
[]
[]
[]
[]
[]
[]
[]
[]
[]
[]
[]
[]
[null,null,"وزن واحد سطح اجزا و مصالح در طبقات:"]
[null,null,"مصالح مصرفي","وزن مخصوص (kg/m3)","ضخامت(m)","تعداد","شدت بار(kg/m2)"]
[2,null,{"$f":"CHOOSE(A19,'وزن مصالح'!E4,'وزن مصالح'!E5,'وزن مصالح'!E6,'وزن مصالح'!E7,'وزن مصالح'!E8,'وزن مصالح'!E9,'وزن مصالح'!E10,'وزن مصالح'!E11,'وزن مصالح'!E12)","v":"بتن آرمه"},{"$f":"CHOOSE(A19,'وزن مصالح'!F4,'وزن مصالح'!F5,'وزن مصالح'!F6,'وزن مصالح'!F7,'وزن مصالح'!F8,'وزن مصالح'!F9,'وزن مصالح'!F10,'وزن مصالح'!F11,'وزن مصالح'!F12)","v":2500},0.1,1,{"$f":"D19*E19*F19","v":250}]
[20,null,{"$f":"CHOOSE(A20,'وزن مصالح'!E25,'وزن مصالح'!E26,'وزن مصالح'!E27,'وزن مصالح'!E28,'وزن مصالح'!E29,'وزن مصالح'!E30,'وزن مصالح'!E31,'وزن مصالح'!E32,'وزن مصالح'!E33,'وزن مصالح'!E34,'وزن مصالح'!E35,'وزن مصالح'!E36,'وزن مصالح'!E37,'وزن مصالح'!E38,'وزن مصالح'!E39,'وزن مصالح'!E40,'وزن مصالح'!E41,'وزن مصالح'!E42,'وزن مصالح'!E43,'وزن مصالح'!E44)","v":"كاشي سراميكي كفي"},{"$f":"CHOOSE(A20,'وزن مصالح'!F25,'وزن مصالح'!F26,'وزن مصالح'!F27,'وزن مصالح'!F28,'وزن مصالح'!F29,'وزن مصالح'!F30,'وزن مصالح'!F31,'وزن مصالح'!F32,'وزن مصالح'!F33,'وزن مصالح'!F34,'وزن مصالح'!F35,'وزن مصالح'!F36,'وزن مصالح'!F37,'وزن مصالح'!F38,'وزن مصالح'!F39,'وزن مصالح'!F40,'وزن مصالح'!F41,'وزن مصالح'!F42,'وزن مصالح'!F43,'وزن مصالح'!F44)","v":2100},0.01,1,{"$f":"D20*E20*F20","v":21}]
[3,null,{"$f":"CHOOSE(A21,'وزن مصالح'!B14,'وزن مصالح'!B15,'وزن مصالح'!B16,'وزن مصالح'!B17,'وزن مصالح'!B18,'وزن مصالح'!B19,'وزن مصالح'!B20,'وزن مصالح'!B21)","v":"ملات ماسه سيمان"},{"$f":"CHOOSE(A21,'وزن مصالح'!C14,'وزن مصالح'!C15,'وزن مصالح'!C16,'وزن مصالح'!C17,'وزن مصالح'!C18,'وزن مصالح'!C19,'وزن مصالح'!C20,'وزن مصالح'!C21)","v":2100},0.03,1,63]
[5,null,{"$f":"CHOOSE(A22,'وزن مصالح'!B24,'وزن مصالح'!B25,'وزن مصالح'!B26,'وزن مصالح'!B27,'وزن مصالح'!B28,'وزن مصالح'!B29)","v":"سقف كاذب با اندود گچي"},{"$f":"CHOOSE(A22,'وزن مصالح'!C24,'وزن مصالح'!C25,'وزن مصالح'!C26,'وزن مصالح'!C27,'وزن مصالح'!C28,'وزن مصالح'!C29)","v":50},"-----","-----",{"$f":"D22","v":50}]
[13,null,{"$f":"CHOOSE(A23,'وزن مصالح'!H4,'وزن مصالح'!H5,'وزن مصالح'!H6,'وزن مصالح'!H7,'وزن مصالح'!H8,'وزن مصالح'!H9,'وزن مصالح'!H10,'وزن مصالح'!H11,'وزن مصالح'!H12,'وزن مصالح'!H13,'وزن مصالح'!H14,'وزن مصالح'!H15,'وزن مصالح'!H16,'وزن مصالح'!H17,'وزن مصالح'!H18,'وزن مصالح'!H19,'وزن مصالح'!H20,'وزن مصالح'!H21,'وزن مصالح'!H22,'وزن مصالح'!H23,'وزن مصالح'!H24,'وزن مصالح'!H25,'وزن مصالح'!H26)","v":"پوكه معدني"},{"$f":"CHOOSE(A23,'وزن مصالح'!I4,'وزن مصالح'!I5,'وزن مصالح'!I6,'وزن مصالح'!I7,'وزن مصالح'!I8,'وزن مصالح'!I9,'وزن مصالح'!I10,'وزن مصالح'!I11,'وزن مصالح'!I12,'وزن مصالح'!I13,'وزن مصالح'!I14,'وزن مصالح'!I15,'وزن مصالح'!I16,'وزن مصالح'!I17,'وزن مصالح'!I18,'وزن مصالح'!I19,'وزن مصالح'!I20,'وزن مصالح'!I21,'وزن مصالح'!I22,'وزن مصالح'!I23,'وزن مصالح'!I24,'وزن مصالح'!I25,'وزن مصالح'!I26)","v":600},0.05,1,{"$f":"D23*E23*F23","v":30}]
[9,null,"وزن واحد تير آهن فرضي",18.8,"-----",1,{"$f":"D24*F24","v":18.8}]
[null,null,"حاصل جمع",null,{"$f":"SUM(G19:G24)","v":432.8}]
[]
[]
[]
[]
[null,null,null,true,null,null,true]
[]
[]
[null,null,null,null,null,null,true]
[null,null,"وزن واحد سطح اجزا و مصالح در طبقات:",{"$f":"CEILING(IF(AND(G30=TRUE,D30=TRUE),E25+'ديوار تيفه'!F40-G19-G24,IF(AND(G30=TRUE,D30=FALSE),E25+'ديوار تيفه'!F40,IF(AND(G30=FALSE,D30=TRUE),E25-G19-G24,IF(AND(G30=FALSE,D30=FALSE),E25)))),5)","v":265},null,null,false]

{"sheet":" كامپوزيت در بام","index":9,"n_rows":35,"n_cols":7,"rows_kept":35,"cut":false,"hidden":false,"merged":[[16,2,16,6],[25,2,25,3],[25,4,25,6],[33,2,34,2],[33,3,34,3]]}
[]
[]
[]
[]
[]
[]
[]
[]
[]
[]
[]
[]
[]
[]
[]
[]
[null,null,"وزن واحد سطح اجزا و مصالح در بام:"]
[null,null,"مصالح مصرفي","وزن مخصوص (kg/m3)","ضخامت(m)","تعداد","شدت بار(kg/m2)"]
[2,null,{"$f":"CHOOSE(A19,'وزن مصالح'!E4,'وزن مصالح'!E5,'وزن مصالح'!E6,'وزن مصالح'!E7,'وزن مصالح'!E8,'وزن مصالح'!E9,'وزن مصالح'!E10,'وزن مصالح'!E11,'وزن مصالح'!E12)","v":"بتن آرمه"},{"$f":"CHOOSE(A19,'وزن مصالح'!F4,'وزن مصالح'!F5,'وزن مصالح'!F6,'وزن مصالح'!F7,'وزن مصالح'!F8,'وزن مصالح'!F9,'وزن مصالح'!F10,'وزن مصالح'!F11,'وزن مصالح'!F12)","v":2500},0.1,1,{"$f":"D19*E19*F19","v":250}]
[7,null,{"$f":"CHOOSE(A20,'وزن مصالح'!E25,'وزن مصالح'!E26,'وزن مصالح'!E27,'وزن مصالح'!E28,'وزن مصالح'!E29,'وزن مصالح'!E30,'وزن مصالح'!E31,'وزن مصالح'!E32,'وزن مصالح'!E33,'وزن مصالح'!E34,'وزن مصالح'!E35,'وزن مصالح'!E36,'وزن مصالح'!E37,'وزن مصالح'!E38,'وزن مصالح'!E39,'وزن مصالح'!E40,'وزن مصالح'!E41,'وزن مصالح'!E42,'وزن مصالح'!E43,'وزن مصالح'!E44)","v":"سنگ موزاييك"},{"$f":"CHOOSE(A20,'وزن مصالح'!F25,'وزن مصالح'!F26,'وزن مصالح'!F27,'وزن مصالح'!F28,'وزن مصالح'!F29,'وزن مصالح'!F30,'وزن مصالح'!F31,'وزن مصالح'!F32,'وزن مصالح'!F33,'وزن مصالح'!F34,'وزن مصالح'!F35,'وزن مصالح'!F36,'وزن مصالح'!F37,'وزن مصالح'!F38,'وزن مصالح'!F39,'وزن مصالح'!F40,'وزن مصالح'!F41,'وزن مصالح'!F42,'وزن مصالح'!F43,'وزن مصالح'!F44)","v":2400},0.01,1,{"$f":"D20*E20*F20","v":24}]
[3,null,{"$f":"CHOOSE(A21,'وزن مصالح'!B14,'وزن مصالح'!B15,'وزن مصالح'!B16,'وزن مصالح'!B17,'وزن مصالح'!B18,'وزن مصالح'!B19,'وزن مصالح'!B20,'وزن مصالح'!B21)","v":"ملات ماسه سيمان"},{"$f":"CHOOSE(A21,'وزن مصالح'!C14,'وزن مصالح'!C15,'وزن مصالح'!C16,'وزن مصالح'!C17,'وزن مصالح'!C18,'وزن مصالح'!C19,'وزن مصالح'!C20,'وزن مصالح'!C21)","v":2100},0.03,1,63]
[5,null,{"$f":"CHOOSE(A22,'وزن مصالح'!B24,'وزن مصالح'!B25,'وزن مصالح'!B26,'وزن مصالح'!B27,'وزن مصالح'!B28,'وزن مصالح'!B29)","v":"سقف كاذب با اندود گچي"},{"$f":"CHOOSE(A22,'وزن مصالح'!C24,'وزن مصالح'!C25,'وزن مصالح'!C26,'وزن مصالح'!C27,'وزن مصالح'!C28,'وزن مصالح'!C29)","v":50},"-----","-----",{"$f":"D22","v":50}]
[3,null,{"$f":"CHOOSE(A23,'وزن مصالح'!B24,'وزن مصالح'!B25,'وزن مصالح'!B26,'وزن مصالح'!B27,'وزن مصالح'!B28,'وزن مصالح'!B29)","v":"گوني قيراندود دو لا"},{"$f":"CHOOSE(A23,'وزن مصالح'!C24,'وزن مصالح'!C25,'وزن مصالح'!C26,'وزن مصالح'!C27,'وزن مصالح'!C28,'وزن مصالح'!C29)","v":15},"-----","-----",{"$f":"D23","v":15}]
[13,null,{"$f":"CHOOSE(A24,'وزن مصالح'!H4,'وزن مصالح'!H5,'وزن مصالح'!H6,'وزن مصالح'!H7,'وزن مصالح'!H8,'وزن مصالح'!H9,'وزن مصالح'!H10,'وزن مصالح'!H11,'وزن مصالح'!H12,'وزن مصالح'!H13,'وزن مصالح'!H14,'وزن مصالح'!H15,'وزن مصالح'!H16,'وزن مصالح'!H17,'وزن مصالح'!H18,'وزن مصالح'!H19,'وزن مصالح'!H20,'وزن مصالح'!H21,'وزن مصالح'!H22,'وزن مصالح'!H23,'وزن مصالح'!H24,'وزن مصالح'!H25,'وزن مصالح'!H26)","v":"پوكه معدني"},{"$f":"CHOOSE(A24,'وزن مصالح'!I4,'وزن مصالح'!I5,'وزن مصالح'!I6,'وزن مصالح'!I7,'وزن مصالح'!I8,'وزن مصالح'!I9,'وزن مصالح'!I10,'وزن مصالح'!I11,'وزن مصالح'!I12,'وزن مصالح'!I13,'وزن مصالح'!I14,'وزن مصالح'!I15,'وزن مصالح'!I16,'وزن مصالح'!I17,'وزن مصالح'!I18,'وزن مصالح'!I19,'وزن مصالح'!I20,'وزن مصالح'!I21,'وزن مصالح'!I22,'وزن مصالح'!I23,'وزن مصالح'!I24,'وزن مصالح'!I25,'وزن مصالح'!I26)","v":600},0.1,1,{"$f":"D24*E24*F24","v":60}]
[9,null,"وزن واحد تير آهن فرضي",18.8,"-----","-----",{"$f":"D25","v":18.8}]
[null,null,"حاصل جمع",null,{"$f":"SUM(G19:G25)","v":480.8}]
[]
[]
[]
[]
[]
[]
[null,null,null,null,null,null,true]
[null,null,"وزن واحد سطح اجزا و مصالح دربام:",{"$f":"CEILING(IF(G33=TRUE,E26-G19-G25,E26),5)","v":215},null,null,true]
[null,null,null,null,null,null,false]

{"sheet":"تيرچه بلوك در طبقات ","index":10,"n_rows":35,"n_cols":7,"rows_kept":35,"cut":false,"hidden":false,"merged":[[16,2,16,6],[26,2,26,3],[26,4,26,6],[33,2,34,2],[33,3,34,3]]}
[]
[]
[]
[]
[]
[]
[]
[]
[]
[]
[]
[]
[]
[]
[]
[]
[null,null,"وزن واحد سطح اجزا و مصالح در طبقات:"]
[841,null,"مصالح مصرفي","وزن مخصوص (kg/m3)","ضخامت(m)","تعداد","شدت بار(kg/m2)"]
[2,null,{"$f":"CHOOSE(A19,'وزن مصالح'!E4,'وزن مصالح'!E5,'وزن مصالح'!E6,'وزن مصالح'!E7,'وزن مصالح'!E8,'وزن مصالح'!E9,'وزن مصالح'!E10,'وزن مصالح'!E11,'وزن مصالح'!E12)","v":"بتن آرمه"},{"$f":"CHOOSE(A19,'وزن مصالح'!F4,'وزن مصالح'!F5,'وزن مصالح'!F6,'وزن مصالح'!F7,'وزن مصالح'!F8,'وزن مصالح'!F9,'وزن مصالح'!F10,'وزن مصالح'!F11,'وزن مصالح'!F12)","v":2500},0.05,1,{"$f":"D19*E19*F19","v":125}]
[2,null,{"$f":"CHOOSE(A20,'وزن مصالح'!E4,'وزن مصالح'!E5,'وزن مصالح'!E6,'وزن مصالح'!E7,'وزن مصالح'!E8,'وزن مصالح'!E9,'وزن مصالح'!E10,'وزن مصالح'!E11,'وزن مصالح'!E12)","v":"بتن آرمه"},{"$f":"CHOOSE(A20,'وزن مصالح'!F4,'وزن مصالح'!F5,'وزن مصالح'!F6,'وزن مصالح'!F7,'وزن مصالح'!F8,'وزن مصالح'!F9,'وزن مصالح'!F10,'وزن مصالح'!F11,'وزن مصالح'!F12)","v":2500},0.02,2,{"$f":"D20*E20*F20","v":100}]
[13,null,{"$f":"CHOOSE(A21,'وزن مصالح'!H4,'وزن مصالح'!H5,'وزن مصالح'!H6,'وزن مصالح'!H7,'وزن مصالح'!H8,'وزن مصالح'!H9,'وزن مصالح'!H10,'وزن مصالح'!H11,'وزن مصالح'!H12,'وزن مصالح'!H13,'وزن مصالح'!H14,'وزن مصالح'!H15,'وزن مصالح'!H16,'وزن مصالح'!H17,'وزن مصالح'!H18,'وزن مصالح'!H19,'وزن مصالح'!H20,'وزن مصالح'!H21,'وزن مصالح'!H22,'وزن مصالح'!H23,'وزن مصالح'!H24,'وزن مصالح'!H25,'وزن مصالح'!H26)","v":"پوكه معدني"},{"$f":"CHOOSE(A21,'وزن مصالح'!I4,'وزن مصالح'!I5,'وزن مصالح'!I6,'وزن مصالح'!I7,'وزن مصالح'!I8,'وزن مصالح'!I9,'وزن مصالح'!I10,'وزن مصالح'!I11,'وزن مصالح'!I12,'وزن مصالح'!I13,'وزن مصالح'!I14,'وزن مصالح'!I15,'وزن مصالح'!I16,'وزن مصالح'!I17,'وزن مصالح'!I18,'وزن مصالح'!I19,'وزن مصالح'!I20,'وزن مصالح'!I21,'وزن مصالح'!I22,'وزن مصالح'!I23,'وزن مصالح'!I24,'وزن مصالح'!I25,'وزن مصالح'!I26)","v":600},0.05,1,30]
[3,null,{"$f":"CHOOSE(A22,'وزن مصالح'!B14,'وزن مصالح'!B15,'وزن مصالح'!B16,'وزن مصالح'!B17,'وزن مصالح'!B18,'وزن مصالح'!B19,'وزن مصالح'!B20,'وزن مصالح'!B21)","v":"ملات ماسه سيمان"},{"$f":"CHOOSE(A22,'وزن مصالح'!C14,'وزن مصالح'!C15,'وزن مصالح'!C16,'وزن مصالح'!C17,'وزن مصالح'!C18,'وزن مصالح'!C19,'وزن مصالح'!C20,'وزن مصالح'!C21)","v":2100},0.03,1,63]
[20,null,{"$f":"CHOOSE(A23,'وزن مصالح'!E25,'وزن مصالح'!E26,'وزن مصالح'!E27,'وزن مصالح'!E28,'وزن مصالح'!E29,'وزن مصالح'!E30,'وزن مصالح'!E31,'وزن مصالح'!E32,'وزن مصالح'!E33,'وزن مصالح'!E34,'وزن مصالح'!E35,'وزن مصالح'!E36,'وزن مصالح'!E37,'وزن مصالح'!E38,'وزن مصالح'!E39,'وزن مصالح'!E40,'وزن مصالح'!E41,'وزن مصالح'!E42,'وزن مصالح'!E43,'وزن مصالح'!E44)","v":"كاشي سراميكي كفي"},{"$f":"CHOOSE(A23,'وزن مصالح'!F25,'وزن مصالح'!F26,'وزن مصالح'!F27,'وزن مصالح'!F28,'وزن مصالح'!F29,'وزن مصالح'!F30,'وزن مصالح'!F31,'وزن مصالح'!F32,'وزن مصالح'!F33,'وزن مصالح'!F34,'وزن مصالح'!F35,'وزن مصالح'!F36,'وزن مصالح'!F37,'وزن مصالح'!F38,'وزن مصالح'!F39,'وزن مصالح'!F40,'وزن مصالح'!F41,'وزن مصالح'!F42,'وزن مصالح'!F43,'وزن مصالح'!F44)","v":2100},0.01,1,21]
[7,null,{"$f":"CHOOSE(A24,'وزن مصالح'!B14,'وزن مصالح'!B15,'وزن مصالح'!B16,'وزن مصالح'!B17,'وزن مصالح'!B18,'وزن مصالح'!B19,'وزن مصالح'!B20,'وزن مصالح'!B21)","v":"ملات گچ و خاك"},{"$f":"CHOOSE(A24,'وزن مصالح'!C14,'وزن مصالح'!C15,'وزن مصالح'!C16,'وزن مصالح'!C17,'وزن مصالح'!C18,'وزن مصالح'!C19,'وزن مصالح'!C20,'وزن مصالح'!C21)","v":1600},0.02,1,32]
[4,null,{"$f":"CHOOSE(A25,'وزن مصالح'!B14,'وزن مصالح'!B15,'وزن مصالح'!B16,'وزن مصالح'!B17,'وزن مصالح'!B18,'وزن مصالح'!B19,'وزن مصالح'!B20,'وزن مصالح'!B21)","v":"ملات گچ"},{"$f":"CHOOSE(A25,'وزن مصالح'!C14,'وزن مصالح'!C15,'وزن مصالح'!C16,'وزن مصالح'!C17,'وزن مصالح'!C18,'وزن مصالح'!C19,'وزن مصالح'!C20,'وزن مصالح'!C21)","v":1300},0.01,1,13]
[9,null,"وزن بلوك",10,"-----",8,{"$f":"D26*F26","v":80}]
[null,null,"حاصل جمع",null,{"$f":"G19+G20+G21+G22+G23+G24+G25+G26","v":464}]
[]
[]
[]
[]
[]
[null,null,null,null,null,null,true]
[null,null,"وزن واحد سطح اجزا و مصالح در طبقات:",{"$f":"CEILING(IF(G33=TRUE,E27+'ديوار تيفه'!F40,E27),5)","v":565},null,null,true]
[null,null,null,null,null,null,false]

{"sheet":"تيرچه بلوك در بام","index":11,"n_rows":34,"n_cols":7,"rows_kept":34,"cut":false,"hidden":false,"merged":[[33,2,34,2],[33,3,34,3],[16,2,16,6],[27,2,27,3],[27,4,27,6]]}
[]
[]
[]
[]
[]
[]
[]
[]
[]
[]
[]
[]
[]
[]
[]
[]
[null,null,"وزن واحد سطح اجزا و مصالح در بام:"]
[null,null,"مصالح مصرفي","وزن مخصوص (kg/m3)","ضخامت(m)","تعداد","شدت بار(kg/m2)"]
[2,null,{"$f":"CHOOSE(A19,'وزن مصالح'!E4,'وزن مصالح'!E5,'وزن مصالح'!E6,'وزن مصالح'!E7,'وزن مصالح'!E8,'وزن مصالح'!E9,'وزن مصالح'!E10,'وزن مصالح'!E11,'وزن مصالح'!E12)","v":"بتن آرمه"},{"$f":"CHOOSE(A19,'وزن مصالح'!F4,'وزن مصالح'!F5,'وزن مصالح'!F6,'وزن مصالح'!F7,'وزن مصالح'!F8,'وزن مصالح'!F9,'وزن مصالح'!F10,'وزن مصالح'!F11,'وزن مصالح'!F12)","v":2500},0.05,1,{"$f":"D19*E19*F19","v":125}]
[2,null,{"$f":"CHOOSE(A20,'وزن مصالح'!E4,'وزن مصالح'!E5,'وزن مصالح'!E6,'وزن مصالح'!E7,'وزن مصالح'!E8,'وزن مصالح'!E9,'وزن مصالح'!E10,'وزن مصالح'!E11,'وزن مصالح'!E12)","v":"بتن آرمه"},{"$f":"CHOOSE(A20,'وزن مصالح'!F4,'وزن مصالح'!F5,'وزن مصالح'!F6,'وزن مصالح'!F7,'وزن مصالح'!F8,'وزن مصالح'!F9,'وزن مصالح'!F10,'وزن مصالح'!F11,'وزن مصالح'!F12)","v":2500},0.02,2,{"$f":"D20*E20*F20","v":100}]
[13,null,{"$f":"CHOOSE(A21,'وزن مصالح'!H4,'وزن مصالح'!H5,'وزن مصالح'!H6,'وزن مصالح'!H7,'وزن مصالح'!H8,'وزن مصالح'!H9,'وزن مصالح'!H10,'وزن مصالح'!H11,'وزن مصالح'!H12,'وزن مصالح'!H13,'وزن مصالح'!H14,'وزن مصالح'!H15,'وزن مصالح'!H16,'وزن مصالح'!H17,'وزن مصالح'!H18,'وزن مصالح'!H19,'وزن مصالح'!H20,'وزن مصالح'!H21,'وزن مصالح'!H22,'وزن مصالح'!H23,'وزن مصالح'!H24,'وزن مصالح'!H25,'وزن مصالح'!H26)","v":"پوكه معدني"},{"$f":"CHOOSE(A21,'وزن مصالح'!I4,'وزن مصالح'!I5,'وزن مصالح'!I6,'وزن مصالح'!I7,'وزن مصالح'!I8,'وزن مصالح'!I9,'وزن مصالح'!I10,'وزن مصالح'!I11,'وزن مصالح'!I12,'وزن مصالح'!I13,'وزن مصالح'!I14,'وزن مصالح'!I15,'وزن مصالح'!I16,'وزن مصالح'!I17,'وزن مصالح'!I18,'وزن مصالح'!I19,'وزن مصالح'!I20,'وزن مصالح'!I21,'وزن مصالح'!I22,'وزن مصالح'!I23,'وزن مصالح'!I24,'وزن مصالح'!I25,'وزن مصالح'!I26)","v":600},0.1,1,60]
[3,null,{"$f":"CHOOSE(A22,'وزن مصالح'!B14,'وزن مصالح'!B15,'وزن مصالح'!B16,'وزن مصالح'!B17,'وزن مصالح'!B18,'وزن مصالح'!B19,'وزن مصالح'!B20,'وزن مصالح'!B21)","v":"ملات ماسه سيمان"},{"$f":"CHOOSE(A22,'وزن مصالح'!C14,'وزن مصالح'!C15,'وزن مصالح'!C16,'وزن مصالح'!C17,'وزن مصالح'!C18,'وزن مصالح'!C19,'وزن مصالح'!C20,'وزن مصالح'!C21)","v":2100},0.03,1,63]
[7,null,{"$f":"CHOOSE(A23,'وزن مصالح'!E25,'وزن مصالح'!E26,'وزن مصالح'!E27,'وزن مصالح'!E28,'وزن مصالح'!E29,'وزن مصالح'!E30,'وزن مصالح'!E31,'وزن مصالح'!E32,'وزن مصالح'!E33,'وزن مصالح'!E34,'وزن مصالح'!E35,'وزن مصالح'!E36,'وزن مصالح'!E37,'وزن مصالح'!E38,'وزن مصالح'!E39,'وزن مصالح'!E40,'وزن مصالح'!E41,'وزن مصالح'!E42,'وزن مصالح'!E43,'وزن مصالح'!E44)","v":"سنگ موزاييك"},{"$f":"CHOOSE(A23,'وزن مصالح'!F25,'وزن مصالح'!F26,'وزن مصالح'!F27,'وزن مصالح'!F28,'وزن مصالح'!F29,'وزن مصالح'!F30,'وزن مصالح'!F31,'وزن مصالح'!F32,'وزن مصالح'!F33,'وزن مصالح'!F34,'وزن مصالح'!F35,'وزن مصالح'!F36,'وزن مصالح'!F37,'وزن مصالح'!F38,'وزن مصالح'!F39,'وزن مصالح'!F40,'وزن مصالح'!F41,'وزن مصالح'!F42,'وزن مصالح'!F43,'وزن مصالح'!F44)","v":2400},0.01,1,24]
[7,null,{"$f":"CHOOSE(A24,'وزن مصالح'!B14,'وزن مصالح'!B15,'وزن مصالح'!B16,'وزن مصالح'!B17,'وزن مصالح'!B18,'وزن مصالح'!B19,'وزن مصالح'!B20,'وزن مصالح'!B21)","v":"ملات گچ و خاك"},{"$f":"CHOOSE(A24,'وزن مصالح'!C14,'وزن مصالح'!C15,'وزن مصالح'!C16,'وزن مصالح'!C17,'وزن مصالح'!C18,'وزن مصالح'!C19,'وزن مصالح'!C20,'وزن مصالح'!C21)","v":1600},0.02,1,32]
[4,null,{"$f":"CHOOSE(A25,'وزن مصالح'!B14,'وزن مصالح'!B15,'وزن مصالح'!B16,'وزن مصالح'!B17,'وزن مصالح'!B18,'وزن مصالح'!B19,'وزن مصالح'!B20,'وزن مصالح'!B21)","v":"ملات گچ"},{"$f":"CHOOSE(A25,'وزن مصالح'!C14,'وزن مصالح'!C15,'وزن مصالح'!C16,'وزن مصالح'!C17,'وزن مصالح'!C18,'وزن مصالح'!C19,'وزن مصالح'!C20,'وزن مصالح'!C21)","v":1300},0.01,1,13]
[3,null,{"$f":"CHOOSE(A26,'وزن مصالح'!B24,'وزن مصالح'!B25,'وزن مصالح'!B26,'وزن مصالح'!B27,'وزن مصالح'!B28,'وزن مصالح'!B29)","v":"گوني قيراندود دو لا"},{"$f":"CHOOSE(A26,'وزن مصالح'!C24,'وزن مصالح'!C25,'وزن مصالح'!C26,'وزن مصالح'!C27,'وزن مصالح'!C28,'وزن مصالح'!C29)","v":15},"-----","-----",{"$f":"D26","v":15}]
[9,null,"وزن بلوك",10,"-----",8,{"$f":"D27*F27","v":80}]
[null,null,"حاصل جمع",null,{"$f":"SUM(G19:G27)","v":512}]
[]
[]
[]
[]
[]
[null,null,"وزن واحد سطح اجزا و مصالح در بام :",{"$f":"CEILING(E28,5)","v":515}]

{"sheet":"کرمیت در طبقات","index":12,"n_rows":35,"n_cols":7,"rows_kept":35,"cut":false,"hidden":false,"merged":[[16,2,16,6],[26,2,26,3],[26,4,26,6],[33,2,34,2],[33,3,34,3]]}
[]
[]
[]
[]
[]
[]
[]
[]
[]
[]
[]
[]
[]
[]
[]
[]
[null,null,"وزن واحد سطح اجزا و مصالح در طبقات:"]
[null,null,"مصالح مصرفي","وزن مخصوص (kg/m3)","ضخامت(m)","تعداد","شدت بار(kg/m2)"]
[2,null,{"$f":"CHOOSE(A19,'وزن مصالح'!E4,'وزن مصالح'!E5,'وزن مصالح'!E6,'وزن مصالح'!E7,'وزن مصالح'!E8,'وزن مصالح'!E9,'وزن مصالح'!E10,'وزن مصالح'!E11,'وزن مصالح'!E12)","v":"بتن آرمه"},{"$f":"CHOOSE(A19,'وزن مصالح'!F4,'وزن مصالح'!F5,'وزن مصالح'!F6,'وزن مصالح'!F7,'وزن مصالح'!F8,'وزن مصالح'!F9,'وزن مصالح'!F10,'وزن مصالح'!F11,'وزن مصالح'!F12)","v":2500},5.5E-2,1,{"$f":"D19*E19*F19","v":137.5}]
[2,null,{"$f":"CHOOSE(A20,'وزن مصالح'!E4,'وزن مصالح'!E5,'وزن مصالح'!E6,'وزن مصالح'!E7,'وزن مصالح'!E8,'وزن مصالح'!E9,'وزن مصالح'!E10,'وزن مصالح'!E11,'وزن مصالح'!E12)","v":"بتن آرمه"},{"$f":"CHOOSE(A20,'وزن مصالح'!F4,'وزن مصالح'!F5,'وزن مصالح'!F6,'وزن مصالح'!F7,'وزن مصالح'!F8,'وزن مصالح'!F9,'وزن مصالح'!F10,'وزن مصالح'!F11,'وزن مصالح'!F12)","v":2500},0.02,2,{"$f":"D20*E20*F20","v":100}]
[13,null,{"$f":"CHOOSE(A21,'وزن مصالح'!H4,'وزن مصالح'!H5,'وزن مصالح'!H6,'وزن مصالح'!H7,'وزن مصالح'!H8,'وزن مصالح'!H9,'وزن مصالح'!H10,'وزن مصالح'!H11,'وزن مصالح'!H12,'وزن مصالح'!H13,'وزن مصالح'!H14,'وزن مصالح'!H15,'وزن مصالح'!H16,'وزن مصالح'!H17,'وزن مصالح'!H18,'وزن مصالح'!H19,'وزن مصالح'!H20,'وزن مصالح'!H21,'وزن مصالح'!H22,'وزن مصالح'!H23,'وزن مصالح'!H24,'وزن مصالح'!H25,'وزن مصالح'!H26)","v":"پوكه معدني"},{"$f":"CHOOSE(A21,'وزن مصالح'!I4,'وزن مصالح'!I5,'وزن مصالح'!I6,'وزن مصالح'!I7,'وزن مصالح'!I8,'وزن مصالح'!I9,'وزن مصالح'!I10,'وزن مصالح'!I11,'وزن مصالح'!I12,'وزن مصالح'!I13,'وزن مصالح'!I14,'وزن مصالح'!I15,'وزن مصالح'!I16,'وزن مصالح'!I17,'وزن مصالح'!I18,'وزن مصالح'!I19,'وزن مصالح'!I20,'وزن مصالح'!I21,'وزن مصالح'!I22,'وزن مصالح'!I23,'وزن مصالح'!I24,'وزن مصالح'!I25,'وزن مصالح'!I26)","v":600},7.4999999999999997E-2,1,45]
[3,null,{"$f":"CHOOSE(A22,'وزن مصالح'!B14,'وزن مصالح'!B15,'وزن مصالح'!B16,'وزن مصالح'!B17,'وزن مصالح'!B18,'وزن مصالح'!B19,'وزن مصالح'!B20,'وزن مصالح'!B21)","v":"ملات ماسه سيمان"},{"$f":"CHOOSE(A22,'وزن مصالح'!C14,'وزن مصالح'!C15,'وزن مصالح'!C16,'وزن مصالح'!C17,'وزن مصالح'!C18,'وزن مصالح'!C19,'وزن مصالح'!C20,'وزن مصالح'!C21)","v":2100},2.5000000000000001E-2,1,52.5]
[13,null,{"$f":"CHOOSE(A23,'وزن مصالح'!E25,'وزن مصالح'!E26,'وزن مصالح'!E27,'وزن مصالح'!E28,'وزن مصالح'!E29,'وزن مصالح'!E30,'وزن مصالح'!E31,'وزن مصالح'!E32,'وزن مصالح'!E33,'وزن مصالح'!E34,'وزن مصالح'!E35,'وزن مصالح'!E36,'وزن مصالح'!E37,'وزن مصالح'!E38,'وزن مصالح'!E39,'وزن مصالح'!E40,'وزن مصالح'!E41,'وزن مصالح'!E42,'وزن مصالح'!E43,'وزن مصالح'!E44)","v":"كف پوش لاستيكي"},{"$f":"CHOOSE(A23,'وزن مصالح'!F25,'وزن مصالح'!F26,'وزن مصالح'!F27,'وزن مصالح'!F28,'وزن مصالح'!F29,'وزن مصالح'!F30,'وزن مصالح'!F31,'وزن مصالح'!F32,'وزن مصالح'!F33,'وزن مصالح'!F34,'وزن مصالح'!F35,'وزن مصالح'!F36,'وزن مصالح'!F37,'وزن مصالح'!F38,'وزن مصالح'!F39,'وزن مصالح'!F40,'وزن مصالح'!F41,'وزن مصالح'!F42,'وزن مصالح'!F43,'وزن مصالح'!F44)","v":1800},5.0000000000000001E-3,1,9]
[7,null,{"$f":"CHOOSE(A24,'وزن مصالح'!B14,'وزن مصالح'!B15,'وزن مصالح'!B16,'وزن مصالح'!B17,'وزن مصالح'!B18,'وزن مصالح'!B19,'وزن مصالح'!B20,'وزن مصالح'!B21)","v":"ملات گچ و خاك"},{"$f":"CHOOSE(A24,'وزن مصالح'!C14,'وزن مصالح'!C15,'وزن مصالح'!C16,'وزن مصالح'!C17,'وزن مصالح'!C18,'وزن مصالح'!C19,'وزن مصالح'!C20,'وزن مصالح'!C21)","v":1600},0.02,1,32]
[4,null,{"$f":"CHOOSE(A25,'وزن مصالح'!B14,'وزن مصالح'!B15,'وزن مصالح'!B16,'وزن مصالح'!B17,'وزن مصالح'!B18,'وزن مصالح'!B19,'وزن مصالح'!B20,'وزن مصالح'!B21)","v":"ملات گچ"},{"$f":"CHOOSE(A25,'وزن مصالح'!C14,'وزن مصالح'!C15,'وزن مصالح'!C16,'وزن مصالح'!C17,'وزن مصالح'!C18,'وزن مصالح'!C19,'وزن مصالح'!C20,'وزن مصالح'!C21)","v":1300},0.01,1,13]
[9,null,"وزن بلوك",5,"-----",1,{"$f":"D26*F26","v":5}]
[null,null,"حاصل جمع",null,{"$f":"G19+G20+G21+G22+G23+G24+G25+G26","v":394}]
[]
[]
[]
[]
[]
[null,null,null,null,null,null,true]
[null,null,"وزن واحد سطح اجزا و مصالح در طبقات:",{"$f":"CEILING(IF(G33=TRUE,E27+'ديوار تيفه'!F40,E27),5)","v":495},null,null,true]
[null,null,null,null,null,null,false]

{"sheet":"کرمیت در بام","index":13,"n_rows":34,"n_cols":7,"rows_kept":34,"cut":false,"hidden":false,"merged":[[16,2,16,6],[27,2,27,3],[27,4,27,6],[33,2,34,2],[33,3,34,3]]}
[]
[]
[]
[]
[]
[]
[]
[]
[]
[]
[]
[]
[]
[]
[]
[]
[null,null,"وزن واحد سطح اجزا و مصالح در بام:"]
[null,null,"مصالح مصرفي","وزن مخصوص (kg/m3)","ضخامت(m)","تعداد","شدت بار(kg/m2)"]
[2,null,{"$f":"CHOOSE(A19,'وزن مصالح'!E4,'وزن مصالح'!E5,'وزن مصالح'!E6,'وزن مصالح'!E7,'وزن مصالح'!E8,'وزن مصالح'!E9,'وزن مصالح'!E10,'وزن مصالح'!E11,'وزن مصالح'!E12)","v":"بتن آرمه"},{"$f":"CHOOSE(A19,'وزن مصالح'!F4,'وزن مصالح'!F5,'وزن مصالح'!F6,'وزن مصالح'!F7,'وزن مصالح'!F8,'وزن مصالح'!F9,'وزن مصالح'!F10,'وزن مصالح'!F11,'وزن مصالح'!F12)","v":2500},5.5E-2,1,{"$f":"D19*E19*F19","v":137.5}]
[2,null,{"$f":"CHOOSE(A20,'وزن مصالح'!E4,'وزن مصالح'!E5,'وزن مصالح'!E6,'وزن مصالح'!E7,'وزن مصالح'!E8,'وزن مصالح'!E9,'وزن مصالح'!E10,'وزن مصالح'!E11,'وزن مصالح'!E12)","v":"بتن آرمه"},{"$f":"CHOOSE(A20,'وزن مصالح'!F4,'وزن مصالح'!F5,'وزن مصالح'!F6,'وزن مصالح'!F7,'وزن مصالح'!F8,'وزن مصالح'!F9,'وزن مصالح'!F10,'وزن مصالح'!F11,'وزن مصالح'!F12)","v":2500},0.02,2,{"$f":"D20*E20*F20","v":100}]
[13,null,{"$f":"CHOOSE(A21,'وزن مصالح'!H4,'وزن مصالح'!H5,'وزن مصالح'!H6,'وزن مصالح'!H7,'وزن مصالح'!H8,'وزن مصالح'!H9,'وزن مصالح'!H10,'وزن مصالح'!H11,'وزن مصالح'!H12,'وزن مصالح'!H13,'وزن مصالح'!H14,'وزن مصالح'!H15,'وزن مصالح'!H16,'وزن مصالح'!H17,'وزن مصالح'!H18,'وزن مصالح'!H19,'وزن مصالح'!H20,'وزن مصالح'!H21,'وزن مصالح'!H22,'وزن مصالح'!H23,'وزن مصالح'!H24,'وزن مصالح'!H25,'وزن مصالح'!H26)","v":"پوكه معدني"},{"$f":"CHOOSE(A21,'وزن مصالح'!I4,'وزن مصالح'!I5,'وزن مصالح'!I6,'وزن مصالح'!I7,'وزن مصالح'!I8,'وزن مصالح'!I9,'وزن مصالح'!I10,'وزن مصالح'!I11,'وزن مصالح'!I12,'وزن مصالح'!I13,'وزن مصالح'!I14,'وزن مصالح'!I15,'وزن مصالح'!I16,'وزن مصالح'!I17,'وزن مصالح'!I18,'وزن مصالح'!I19,'وزن مصالح'!I20,'وزن مصالح'!I21,'وزن مصالح'!I22,'وزن مصالح'!I23,'وزن مصالح'!I24,'وزن مصالح'!I25,'وزن مصالح'!I26)","v":600},0.1,1,60]
[3,null,{"$f":"CHOOSE(A22,'وزن مصالح'!B14,'وزن مصالح'!B15,'وزن مصالح'!B16,'وزن مصالح'!B17,'وزن مصالح'!B18,'وزن مصالح'!B19,'وزن مصالح'!B20,'وزن مصالح'!B21)","v":"ملات ماسه سيمان"},{"$f":"CHOOSE(A22,'وزن مصالح'!C14,'وزن مصالح'!C15,'وزن مصالح'!C16,'وزن مصالح'!C17,'وزن مصالح'!C18,'وزن مصالح'!C19,'وزن مصالح'!C20,'وزن مصالح'!C21)","v":2100},0.03,1,63]
[6,null,{"$f":"CHOOSE(A23,'وزن مصالح'!E25,'وزن مصالح'!E26,'وزن مصالح'!E27,'وزن مصالح'!E28,'وزن مصالح'!E29,'وزن مصالح'!E30,'وزن مصالح'!E31,'وزن مصالح'!E32,'وزن مصالح'!E33,'وزن مصالح'!E34,'وزن مصالح'!E35,'وزن مصالح'!E36,'وزن مصالح'!E37,'وزن مصالح'!E38,'وزن مصالح'!E39,'وزن مصالح'!E40,'وزن مصالح'!E41,'وزن مصالح'!E42,'وزن مصالح'!E43,'وزن مصالح'!E44)","v":"موزاييك سيماني"},{"$f":"CHOOSE(A23,'وزن مصالح'!F25,'وزن مصالح'!F26,'وزن مصالح'!F27,'وزن مصالح'!F28,'وزن مصالح'!F29,'وزن مصالح'!F30,'وزن مصالح'!F31,'وزن مصالح'!F32,'وزن مصالح'!F33,'وزن مصالح'!F34,'وزن مصالح'!F35,'وزن مصالح'!F36,'وزن مصالح'!F37,'وزن مصالح'!F38,'وزن مصالح'!F39,'وزن مصالح'!F40,'وزن مصالح'!F41,'وزن مصالح'!F42,'وزن مصالح'!F43,'وزن مصالح'!F44)","v":2250},0.01,1,22.5]
[7,null,{"$f":"CHOOSE(A24,'وزن مصالح'!B14,'وزن مصالح'!B15,'وزن مصالح'!B16,'وزن مصالح'!B17,'وزن مصالح'!B18,'وزن مصالح'!B19,'وزن مصالح'!B20,'وزن مصالح'!B21)","v":"ملات گچ و خاك"},{"$f":"CHOOSE(A24,'وزن مصالح'!C14,'وزن مصالح'!C15,'وزن مصالح'!C16,'وزن مصالح'!C17,'وزن مصالح'!C18,'وزن مصالح'!C19,'وزن مصالح'!C20,'وزن مصالح'!C21)","v":1600},0.02,1,32]
[4,null,{"$f":"CHOOSE(A25,'وزن مصالح'!B14,'وزن مصالح'!B15,'وزن مصالح'!B16,'وزن مصالح'!B17,'وزن مصالح'!B18,'وزن مصالح'!B19,'وزن مصالح'!B20,'وزن مصالح'!B21)","v":"ملات گچ"},{"$f":"CHOOSE(A25,'وزن مصالح'!C14,'وزن مصالح'!C15,'وزن مصالح'!C16,'وزن مصالح'!C17,'وزن مصالح'!C18,'وزن مصالح'!C19,'وزن مصالح'!C20,'وزن مصالح'!C21)","v":1300},0.01,1,13]
[3,null,{"$f":"CHOOSE(A26,'وزن مصالح'!B24,'وزن مصالح'!B25,'وزن مصالح'!B26,'وزن مصالح'!B27,'وزن مصالح'!B28,'وزن مصالح'!B29)","v":"گوني قيراندود دو لا"},{"$f":"CHOOSE(A26,'وزن مصالح'!C24,'وزن مصالح'!C25,'وزن مصالح'!C26,'وزن مصالح'!C27,'وزن مصالح'!C28,'وزن مصالح'!C29)","v":15},"-----","-----",{"$f":"D26","v":15}]
[9,null,"وزن بلوك",5,"-----",1,{"$f":"D27*F27","v":5}]
[null,null,"حاصل جمع",null,{"$f":"SUM(G19:G27)","v":448}]
[]
[]
[]
[]
[]
[null,null,"وزن واحد سطح اجزا و مصالح در بام :",{"$f":"CEILING(E28,5)","v":450}]

{"sheet":"کرمیت کامپوزیت در طبقات","index":14,"n_rows":35,"n_cols":7,"rows_kept":35,"cut":false,"hidden":false,"merged":[[16,2,16,6],[24,2,24,3],[24,4,24,6],[33,2,34,2],[33,3,34,3]]}
[]
[]
[]
[]
[]
[]
[]
[]
[]
[]
[]
[]
[]
[]
[]
[]
[null,null,"وزن واحد سطح اجزا و مصالح در طبقات:"]
[841,null,"مصالح مصرفي","وزن مخصوص (kg/m3)","ضخامت(m)","تعداد","شدت بار(kg/m2)"]
[2,null,{"$f":"CHOOSE(A19,'وزن مصالح'!E4,'وزن مصالح'!E5,'وزن مصالح'!E6,'وزن مصالح'!E7,'وزن مصالح'!E8,'وزن مصالح'!E9,'وزن مصالح'!E10,'وزن مصالح'!E11,'وزن مصالح'!E12)","v":"بتن آرمه"},{"$f":"CHOOSE(A19,'وزن مصالح'!F4,'وزن مصالح'!F5,'وزن مصالح'!F6,'وزن مصالح'!F7,'وزن مصالح'!F8,'وزن مصالح'!F9,'وزن مصالح'!F10,'وزن مصالح'!F11,'وزن مصالح'!F12)","v":2500},0.05,1,{"$f":"D19*E19*F19","v":125}]
[2,null,{"$f":"CHOOSE(A20,'وزن مصالح'!E4,'وزن مصالح'!E5,'وزن مصالح'!E6,'وزن مصالح'!E7,'وزن مصالح'!E8,'وزن مصالح'!E9,'وزن مصالح'!E10,'وزن مصالح'!E11,'وزن مصالح'!E12)","v":"بتن آرمه"},{"$f":"CHOOSE(A20,'وزن مصالح'!F4,'وزن مصالح'!F5,'وزن مصالح'!F6,'وزن مصالح'!F7,'وزن مصالح'!F8,'وزن مصالح'!F9,'وزن مصالح'!F10,'وزن مصالح'!F11,'وزن مصالح'!F12)","v":2500},0.02,2,{"$f":"D20*E20*F20","v":100}]
[13,null,{"$f":"CHOOSE(A21,'وزن مصالح'!H4,'وزن مصالح'!H5,'وزن مصالح'!H6,'وزن مصالح'!H7,'وزن مصالح'!H8,'وزن مصالح'!H9,'وزن مصالح'!H10,'وزن مصالح'!H11,'وزن مصالح'!H12,'وزن مصالح'!H13,'وزن مصالح'!H14,'وزن مصالح'!H15,'وزن مصالح'!H16,'وزن مصالح'!H17,'وزن مصالح'!H18,'وزن مصالح'!H19,'وزن مصالح'!H20,'وزن مصالح'!H21,'وزن مصالح'!H22,'وزن مصالح'!H23,'وزن مصالح'!H24,'وزن مصالح'!H25,'وزن مصالح'!H26)","v":"پوكه معدني"},{"$f":"CHOOSE(A21,'وزن مصالح'!I4,'وزن مصالح'!I5,'وزن مصالح'!I6,'وزن مصالح'!I7,'وزن مصالح'!I8,'وزن مصالح'!I9,'وزن مصالح'!I10,'وزن مصالح'!I11,'وزن مصالح'!I12,'وزن مصالح'!I13,'وزن مصالح'!I14,'وزن مصالح'!I15,'وزن مصالح'!I16,'وزن مصالح'!I17,'وزن مصالح'!I18,'وزن مصالح'!I19,'وزن مصالح'!I20,'وزن مصالح'!I21,'وزن مصالح'!I22,'وزن مصالح'!I23,'وزن مصالح'!I24,'وزن مصالح'!I25,'وزن مصالح'!I26)","v":600},0.05,1,30]
[3,null,{"$f":"CHOOSE(A22,'وزن مصالح'!B14,'وزن مصالح'!B15,'وزن مصالح'!B16,'وزن مصالح'!B17,'وزن مصالح'!B18,'وزن مصالح'!B19,'وزن مصالح'!B20,'وزن مصالح'!B21)","v":"ملات ماسه سيمان"},{"$f":"CHOOSE(A22,'وزن مصالح'!C14,'وزن مصالح'!C15,'وزن مصالح'!C16,'وزن مصالح'!C17,'وزن مصالح'!C18,'وزن مصالح'!C19,'وزن مصالح'!C20,'وزن مصالح'!C21)","v":2100},0.03,1,63]
[20,null,{"$f":"CHOOSE(A23,'وزن مصالح'!E25,'وزن مصالح'!E26,'وزن مصالح'!E27,'وزن مصالح'!E28,'وزن مصالح'!E29,'وزن مصالح'!E30,'وزن مصالح'!E31,'وزن مصالح'!E32,'وزن مصالح'!E33,'وزن مصالح'!E34,'وزن مصالح'!E35,'وزن مصالح'!E36,'وزن مصالح'!E37,'وزن مصالح'!E38,'وزن مصالح'!E39,'وزن مصالح'!E40,'وزن مصالح'!E41,'وزن مصالح'!E42,'وزن مصالح'!E43,'وزن مصالح'!E44)","v":"كاشي سراميكي كفي"},{"$f":"CHOOSE(A23,'وزن مصالح'!F25,'وزن مصالح'!F26,'وزن مصالح'!F27,'وزن مصالح'!F28,'وزن مصالح'!F29,'وزن مصالح'!F30,'وزن مصالح'!F31,'وزن مصالح'!F32,'وزن مصالح'!F33,'وزن مصالح'!F34,'وزن مصالح'!F35,'وزن مصالح'!F36,'وزن مصالح'!F37,'وزن مصالح'!F38,'وزن مصالح'!F39,'وزن مصالح'!F40,'وزن مصالح'!F41,'وزن مصالح'!F42,'وزن مصالح'!F43,'وزن مصالح'!F44)","v":2100},0.01,1,21]
[5,null,{"$f":"CHOOSE(A24,'وزن مصالح'!B24,'وزن مصالح'!B25,'وزن مصالح'!B26,'وزن مصالح'!B27,'وزن مصالح'!B28,'وزن مصالح'!B29)","v":"سقف كاذب با اندود گچي"},{"$f":"CHOOSE(A24,'وزن مصالح'!C24,'وزن مصالح'!C25,'وزن مصالح'!C26,'وزن مصالح'!C27,'وزن مصالح'!C28,'وزن مصالح'!C29)","v":50},0.02,1,1]
[null,null,"حاصل جمع",null,{"$f":"G19+G20+G21+G22+G23+G24","v":340}]
[]
[]
[]
[]
[]
[]
[]
[null,null,null,null,null,null,true]
[null,null,"وزن واحد سطح اجزا و مصالح در طبقات:",{"$f":"CEILING(IF(G33=TRUE,E25+'ديوار تيفه'!F40,E25),5)","v":440},null,null,true]
[null,null,null,null,null,null,false]

{"sheet":"کرمیت کامپوزیت در بام","index":15,"n_rows":34,"n_cols":7,"rows_kept":34,"cut":false,"hidden":false,"merged":[[16,2,16,6],[25,2,25,3],[25,4,25,6],[33,2,34,2],[33,3,34,3]]}
[]
[]
[]
[]
[]
[]
[]
[]
[]
[]
[]
[]
[]
[]
[]
[]
[null,null,"وزن واحد سطح اجزا و مصالح در بام:"]
[null,null,"مصالح مصرفي","وزن مخصوص (kg/m3)","ضخامت(m)","تعداد","شدت بار(kg/m2)"]
[2,null,{"$f":"CHOOSE(A19,'وزن مصالح'!E4,'وزن مصالح'!E5,'وزن مصالح'!E6,'وزن مصالح'!E7,'وزن مصالح'!E8,'وزن مصالح'!E9,'وزن مصالح'!E10,'وزن مصالح'!E11,'وزن مصالح'!E12)","v":"بتن آرمه"},{"$f":"CHOOSE(A19,'وزن مصالح'!F4,'وزن مصالح'!F5,'وزن مصالح'!F6,'وزن مصالح'!F7,'وزن مصالح'!F8,'وزن مصالح'!F9,'وزن مصالح'!F10,'وزن مصالح'!F11,'وزن مصالح'!F12)","v":2500},5.5E-2,1,{"$f":"D19*E19*F19","v":137.5}]
[2,null,{"$f":"CHOOSE(A20,'وزن مصالح'!E4,'وزن مصالح'!E5,'وزن مصالح'!E6,'وزن مصالح'!E7,'وزن مصالح'!E8,'وزن مصالح'!E9,'وزن مصالح'!E10,'وزن مصالح'!E11,'وزن مصالح'!E12)","v":"بتن آرمه"},{"$f":"CHOOSE(A20,'وزن مصالح'!F4,'وزن مصالح'!F5,'وزن مصالح'!F6,'وزن مصالح'!F7,'وزن مصالح'!F8,'وزن مصالح'!F9,'وزن مصالح'!F10,'وزن مصالح'!F11,'وزن مصالح'!F12)","v":2500},0.02,2,{"$f":"D20*E20*F20","v":100}]
[13,null,{"$f":"CHOOSE(A21,'وزن مصالح'!H4,'وزن مصالح'!H5,'وزن مصالح'!H6,'وزن مصالح'!H7,'وزن مصالح'!H8,'وزن مصالح'!H9,'وزن مصالح'!H10,'وزن مصالح'!H11,'وزن مصالح'!H12,'وزن مصالح'!H13,'وزن مصالح'!H14,'وزن مصالح'!H15,'وزن مصالح'!H16,'وزن مصالح'!H17,'وزن مصالح'!H18,'وزن مصالح'!H19,'وزن مصالح'!H20,'وزن مصالح'!H21,'وزن مصالح'!H22,'وزن مصالح'!H23,'وزن مصالح'!H24,'وزن مصالح'!H25,'وزن مصالح'!H26)","v":"پوكه معدني"},{"$f":"CHOOSE(A21,'وزن مصالح'!I4,'وزن مصالح'!I5,'وزن مصالح'!I6,'وزن مصالح'!I7,'وزن مصالح'!I8,'وزن مصالح'!I9,'وزن مصالح'!I10,'وزن مصالح'!I11,'وزن مصالح'!I12,'وزن مصالح'!I13,'وزن مصالح'!I14,'وزن مصالح'!I15,'وزن مصالح'!I16,'وزن مصالح'!I17,'وزن مصالح'!I18,'وزن مصالح'!I19,'وزن مصالح'!I20,'وزن مصالح'!I21,'وزن مصالح'!I22,'وزن مصالح'!I23,'وزن مصالح'!I24,'وزن مصالح'!I25,'وزن مصالح'!I26)","v":600},0.1,1,60]
[3,null,{"$f":"CHOOSE(A22,'وزن مصالح'!B14,'وزن مصالح'!B15,'وزن مصالح'!B16,'وزن مصالح'!B17,'وزن مصالح'!B18,'وزن مصالح'!B19,'وزن مصالح'!B20,'وزن مصالح'!B21)","v":"ملات ماسه سيمان"},{"$f":"CHOOSE(A22,'وزن مصالح'!C14,'وزن مصالح'!C15,'وزن مصالح'!C16,'وزن مصالح'!C17,'وزن مصالح'!C18,'وزن مصالح'!C19,'وزن مصالح'!C20,'وزن مصالح'!C21)","v":2100},0.03,1,63]
[6,null,{"$f":"CHOOSE(A23,'وزن مصالح'!E25,'وزن مصالح'!E26,'وزن مصالح'!E27,'وزن مصالح'!E28,'وزن مصالح'!E29,'وزن مصالح'!E30,'وزن مصالح'!E31,'وزن مصالح'!E32,'وزن مصالح'!E33,'وزن مصالح'!E34,'وزن مصالح'!E35,'وزن مصالح'!E36,'وزن مصالح'!E37,'وزن مصالح'!E38,'وزن مصالح'!E39,'وزن مصالح'!E40,'وزن مصالح'!E41,'وزن مصالح'!E42,'وزن مصالح'!E43,'وزن مصالح'!E44)","v":"موزاييك سيماني"},{"$f":"CHOOSE(A23,'وزن مصالح'!F25,'وزن مصالح'!F26,'وزن مصالح'!F27,'وزن مصالح'!F28,'وزن مصالح'!F29,'وزن مصالح'!F30,'وزن مصالح'!F31,'وزن مصالح'!F32,'وزن مصالح'!F33,'وزن مصالح'!F34,'وزن مصالح'!F35,'وزن مصالح'!F36,'وزن مصالح'!F37,'وزن مصالح'!F38,'وزن مصالح'!F39,'وزن مصالح'!F40,'وزن مصالح'!F41,'وزن مصالح'!F42,'وزن مصالح'!F43,'وزن مصالح'!F44)","v":2250},0.01,1,22.5]
[1,null,{"$f":"CHOOSE(A24,'وزن مصالح'!B24,'وزن مصالح'!B25,'وزن مصالح'!B26,'وزن مصالح'!B27,'وزن مصالح'!B28,'وزن مصالح'!B29)","v":"پوشش شيرواني با سفال"},{"$f":"CHOOSE(A24,'وزن مصالح'!C24,'وزن مصالح'!C25,'وزن مصالح'!C26,'وزن مصالح'!C27,'وزن مصالح'!C28,'وزن مصالح'!C29)","v":70},0.02,1,1.4000000000000001]
[1,null,{"$f":"CHOOSE(A25,'وزن مصالح'!B24,'وزن مصالح'!B25,'وزن مصالح'!B26,'وزن مصالح'!B27,'وزن مصالح'!B28,'وزن مصالح'!B29)","v":"پوشش شيرواني با سفال"},{"$f":"CHOOSE(A25,'وزن مصالح'!C24,'وزن مصالح'!C25,'وزن مصالح'!C26,'وزن مصالح'!C27,'وزن مصالح'!C28,'وزن مصالح'!C29)","v":70},0.01,1,0.70000000000000007]
[1,null,"حاصل جمع",null,{"$f":"SUM(G19:G25)","v":385.09999999999997}]
[]
[]
[]
[]
[]
[]
[]
[null,null,"وزن واحد سطح اجزا و مصالح در بام :",{"$f":"CEILING(E26,5)","v":390}]

{"sheet":"دال در طبقات","index":16,"n_rows":34,"n_cols":7,"rows_kept":34,"cut":false,"hidden":false,"merged":[[16,2,16,6],[23,2,23,3],[23,4,23,6],[33,2,34,2],[33,3,34,3]]}
[]
[]
[]
[]
[]
[]
[]
[]
[]
[]
[]
[]
[]
[]
[]
[]
[null,null,"وزن واحد سطح اجزا و مصالح در طبقات:"]
[null,null,"مصالح مصرفي","وزن مخصوص (kg/m3)","ضخامت(m)","تعداد","شدت بار(kg/m2)"]
[2,null,{"$f":"CHOOSE(A19,'وزن مصالح'!E4,'وزن مصالح'!E5,'وزن مصالح'!E6,'وزن مصالح'!E7,'وزن مصالح'!E8,'وزن مصالح'!E9,'وزن مصالح'!E10,'وزن مصالح'!E11,'وزن مصالح'!E12)","v":"بتن آرمه"},{"$f":"CHOOSE(A19,'وزن مصالح'!F4,'وزن مصالح'!F5,'وزن مصالح'!F6,'وزن مصالح'!F7,'وزن مصالح'!F8,'وزن مصالح'!F9,'وزن مصالح'!F10,'وزن مصالح'!F11,'وزن مصالح'!F12)","v":2500},0.1,1,{"$f":"D19*E19*F19","v":250}]
[13,null,{"$f":"CHOOSE(A20,'وزن مصالح'!H4,'وزن مصالح'!H5,'وزن مصالح'!H6,'وزن مصالح'!H7,'وزن مصالح'!H8,'وزن مصالح'!H9,'وزن مصالح'!H10,'وزن مصالح'!H11,'وزن مصالح'!H12,'وزن مصالح'!H13,'وزن مصالح'!H14,'وزن مصالح'!H15,'وزن مصالح'!H16,'وزن مصالح'!H17,'وزن مصالح'!H18,'وزن مصالح'!H19,'وزن مصالح'!H20,'وزن مصالح'!H21,'وزن مصالح'!H22,'وزن مصالح'!H23,'وزن مصالح'!H24,'وزن مصالح'!H25,'وزن مصالح'!H26)","v":"پوكه معدني"},{"$f":"CHOOSE(A20,'وزن مصالح'!I4,'وزن مصالح'!I5,'وزن مصالح'!I6,'وزن مصالح'!I7,'وزن مصالح'!I8,'وزن مصالح'!I9,'وزن مصالح'!I10,'وزن مصالح'!I11,'وزن مصالح'!I12,'وزن مصالح'!I13,'وزن مصالح'!I14,'وزن مصالح'!I15,'وزن مصالح'!I16,'وزن مصالح'!I17,'وزن مصالح'!I18,'وزن مصالح'!I19,'وزن مصالح'!I20,'وزن مصالح'!I21,'وزن مصالح'!I22,'وزن مصالح'!I23,'وزن مصالح'!I24,'وزن مصالح'!I25,'وزن مصالح'!I26)","v":600},0.05,1,{"$f":"D20*E20*F20","v":30}]
[3,null,{"$f":"CHOOSE(A21,'وزن مصالح'!B14,'وزن مصالح'!B15,'وزن مصالح'!B16,'وزن مصالح'!B17,'وزن مصالح'!B18,'وزن مصالح'!B19,'وزن مصالح'!B20,'وزن مصالح'!B21)","v":"ملات ماسه سيمان"},{"$f":"CHOOSE(A21,'وزن مصالح'!C14,'وزن مصالح'!C15,'وزن مصالح'!C16,'وزن مصالح'!C17,'وزن مصالح'!C18,'وزن مصالح'!C19,'وزن مصالح'!C20,'وزن مصالح'!C21)","v":2100},0.03,1,63]
[20,null,{"$f":"CHOOSE(A22,'وزن مصالح'!E25,'وزن مصالح'!E26,'وزن مصالح'!E27,'وزن مصالح'!E28,'وزن مصالح'!E29,'وزن مصالح'!E30,'وزن مصالح'!E31,'وزن مصالح'!E32,'وزن مصالح'!E33,'وزن مصالح'!E34,'وزن مصالح'!E35,'وزن مصالح'!E36,'وزن مصالح'!E37,'وزن مصالح'!E38,'وزن مصالح'!E39,'وزن مصالح'!E40,'وزن مصالح'!E41,'وزن مصالح'!E42,'وزن مصالح'!E43,'وزن مصالح'!E44)","v":"كاشي سراميكي كفي"},{"$f":"CHOOSE(A22,'وزن مصالح'!F25,'وزن مصالح'!F26,'وزن مصالح'!F27,'وزن مصالح'!F28,'وزن مصالح'!F29,'وزن مصالح'!F30,'وزن مصالح'!F31,'وزن مصالح'!F32,'وزن مصالح'!F33,'وزن مصالح'!F34,'وزن مصالح'!F35,'وزن مصالح'!F36,'وزن مصالح'!F37,'وزن مصالح'!F38,'وزن مصالح'!F39,'وزن مصالح'!F40,'وزن مصالح'!F41,'وزن مصالح'!F42,'وزن مصالح'!F43,'وزن مصالح'!F44)","v":2100},0.01,1,21]
[5,null,{"$f":"CHOOSE(A23,'وزن مصالح'!B24,'وزن مصالح'!B25,'وزن مصالح'!B26,'وزن مصالح'!B27,'وزن مصالح'!B28,'وزن مصالح'!B29)","v":"سقف كاذب با اندود گچي"},{"$f":"CHOOSE(A23,'وزن مصالح'!C24,'وزن مصالح'!C25,'وزن مصالح'!C26,'وزن مصالح'!C27,'وزن مصالح'!C28,'وزن مصالح'!C29)","v":50},"----","----",{"$f":"D23","v":50}]
[null,null,"حاصل جمع",null,{"$f":"SUM(G19:G23)","v":414}]
[]
[]
[]
[]
[]
[null,null,null,true,null,null,true]
[]
[null,null,null,null,null,null,true]
[null,null,null,null,null,null,false]
[null,null,"وزن واحد سطح اجزا و مصالح در طبقات:",{"$f":"CEILING(IF(AND(G30=TRUE,D30=TRUE),E24+'ديوار تيفه'!F40-G19,IF(AND(G30=TRUE,D30=FALSE),E24+'ديوار تيفه'!F40,IF(AND(G30=FALSE,D30=TRUE),E24-G19,IF(AND(G30=FALSE,D30=FALSE),E24)))),5)","v":265}]

{"sheet":"دال در بام","index":17,"n_rows":34,"n_cols":7,"rows_kept":34,"cut":false,"hidden":false,"merged":[[16,2,16,6],[24,2,24,3],[24,4,24,6],[33,2,34,2],[33,3,34,3]]}
[]
[]
[]
[]
[]
[]
[]
[]
[]
[]
[]
[]
[]
[]
[]
[]
[null,null,"وزن واحد سطح اجزا و مصالح در بام :"]
[null,null,"مصالح مصرفي","وزن مخصوص (kg/m3)","ضخامت(m)","تعداد","شدت بار(kg/m2)"]
[2,null,{"$f":"CHOOSE(A19,'وزن مصالح'!E4,'وزن مصالح'!E5,'وزن مصالح'!E6,'وزن مصالح'!E7,'وزن مصالح'!E8,'وزن مصالح'!E9,'وزن مصالح'!E10,'وزن مصالح'!E11,'وزن مصالح'!E12)","v":"بتن آرمه"},{"$f":"CHOOSE(A19,'وزن مصالح'!F4,'وزن مصالح'!F5,'وزن مصالح'!F6,'وزن مصالح'!F7,'وزن مصالح'!F8,'وزن مصالح'!F9,'وزن مصالح'!F10,'وزن مصالح'!F11,'وزن مصالح'!F12)","v":2500},0.1,1,{"$f":"D19*E19*F19","v":250}]
[13,null,{"$f":"CHOOSE(A20,'وزن مصالح'!H4,'وزن مصالح'!H5,'وزن مصالح'!H6,'وزن مصالح'!H7,'وزن مصالح'!H8,'وزن مصالح'!H9,'وزن مصالح'!H10,'وزن مصالح'!H11,'وزن مصالح'!H12,'وزن مصالح'!H13,'وزن مصالح'!H14,'وزن مصالح'!H15,'وزن مصالح'!H16,'وزن مصالح'!H17,'وزن مصالح'!H18,'وزن مصالح'!H19,'وزن مصالح'!H20,'وزن مصالح'!H21,'وزن مصالح'!H22,'وزن مصالح'!H23,'وزن مصالح'!H24,'وزن مصالح'!H25,'وزن مصالح'!H26)","v":"پوكه معدني"},{"$f":"CHOOSE(A20,'وزن مصالح'!I4,'وزن مصالح'!I5,'وزن مصالح'!I6,'وزن مصالح'!I7,'وزن مصالح'!I8,'وزن مصالح'!I9,'وزن مصالح'!I10,'وزن مصالح'!I11,'وزن مصالح'!I12,'وزن مصالح'!I13,'وزن مصالح'!I14,'وزن مصالح'!I15,'وزن مصالح'!I16,'وزن مصالح'!I17,'وزن مصالح'!I18,'وزن مصالح'!I19,'وزن مصالح'!I20,'وزن مصالح'!I21,'وزن مصالح'!I22,'وزن مصالح'!I23,'وزن مصالح'!I24,'وزن مصالح'!I25,'وزن مصالح'!I26)","v":600},0.1,1,{"$f":"D20*E20*F20","v":60}]
[3,null,{"$f":"CHOOSE(A21,'وزن مصالح'!B14,'وزن مصالح'!B15,'وزن مصالح'!B16,'وزن مصالح'!B17,'وزن مصالح'!B18,'وزن مصالح'!B19,'وزن مصالح'!B20,'وزن مصالح'!B21)","v":"ملات ماسه سيمان"},{"$f":"CHOOSE(A21,'وزن مصالح'!C14,'وزن مصالح'!C15,'وزن مصالح'!C16,'وزن مصالح'!C17,'وزن مصالح'!C18,'وزن مصالح'!C19,'وزن مصالح'!C20,'وزن مصالح'!C21)","v":2100},0.03,1,63]
[7,null,{"$f":"CHOOSE(A22,'وزن مصالح'!E25,'وزن مصالح'!E26,'وزن مصالح'!E27,'وزن مصالح'!E28,'وزن مصالح'!E29,'وزن مصالح'!E30,'وزن مصالح'!E31,'وزن مصالح'!E32,'وزن مصالح'!E33,'وزن مصالح'!E34,'وزن مصالح'!E35,'وزن مصالح'!E36,'وزن مصالح'!E37,'وزن مصالح'!E38,'وزن مصالح'!E39,'وزن مصالح'!E40,'وزن مصالح'!E41,'وزن مصالح'!E42,'وزن مصالح'!E43,'وزن مصالح'!E44)","v":"سنگ موزاييك"},{"$f":"CHOOSE(A22,'وزن مصالح'!F25,'وزن مصالح'!F26,'وزن مصالح'!F27,'وزن مصالح'!F28,'وزن مصالح'!F29,'وزن مصالح'!F30,'وزن مصالح'!F31,'وزن مصالح'!F32,'وزن مصالح'!F33,'وزن مصالح'!F34,'وزن مصالح'!F35,'وزن مصالح'!F36,'وزن مصالح'!F37,'وزن مصالح'!F38,'وزن مصالح'!F39,'وزن مصالح'!F40,'وزن مصالح'!F41,'وزن مصالح'!F42,'وزن مصالح'!F43,'وزن مصالح'!F44)","v":2400},0.01,1,24]
[5,null,{"$f":"CHOOSE(A23,'وزن مصالح'!B24,'وزن مصالح'!B25,'وزن مصالح'!B26,'وزن مصالح'!B27,'وزن مصالح'!B28,'وزن مصالح'!B29)","v":"سقف كاذب با اندود گچي"},{"$f":"CHOOSE(A23,'وزن مصالح'!C24,'وزن مصالح'!C25,'وزن مصالح'!C26,'وزن مصالح'!C27,'وزن مصالح'!C28,'وزن مصالح'!C29)","v":50},"-----","----",{"$f":"D23","v":50}]
[3,null,{"$f":"CHOOSE(A24,'وزن مصالح'!B24,'وزن مصالح'!B25,'وزن مصالح'!B26,'وزن مصالح'!B27,'وزن مصالح'!B28,'وزن مصالح'!B29)","v":"گوني قيراندود دو لا"},{"$f":"CHOOSE(A24,'وزن مصالح'!C24,'وزن مصالح'!C25,'وزن مصالح'!C26,'وزن مصالح'!C27,'وزن مصالح'!C28,'وزن مصالح'!C29)","v":15},"-----","-----",{"$f":"D24","v":15}]
[null,null,"حاصل جمع",null,{"$f":"SUM(G19:G24)","v":462}]
[]
[]
[]
[]
[]
[null,null,null,null,null,null,true]
[null,null,null,null,null,null,true]
[null,null,null,null,null,null,false]
[null,null,"وزن واحد سطح اجزا و مصالح در بام :",{"$f":"CEILING(IF(G31=TRUE,E25-G19,E25),5)","v":215}]

{"sheet":"بار برف","index":18,"n_rows":122,"n_cols":23,"rows_kept":122,"cut":false,"hidden":false,"merged":[[55,8,56,9],[44,6,45,7],[19,8,20,9],[21,8,22,9],[17,5,18,7],[27,9,30,9],[26,3,26,8],[27,7,28,8],[27,5,28,6],[27,3,28,4],[19,3,20,4],[19,5,20,7],[21,3,22,4],[21,5,22,7],[40,3,41,6],[38,3,39,6],[12,5,12,6],[12,7,12,9],[11,7,11,9],[10,7,10,9],[9,7,9,9],[9,5,9,6],[10,5,10,6],[11,5,11,6],[38,7,39,9],[40,7,41,9],[24,5,25,7],[31,9,33,9],[31,3,33,8],[34,3,36,8],[34,9,36,9],[29,7,30,8],[29,5,30,6],[29,3,30,4],[2,3,3,9],[7,7,7,9],[7,5,7,6],[8,5,8,6],[8,7,8,9],[5,3,6,9],[65,5,65,6],[62,5,62,6],[63,5,63,6],[64,5,64,6],[27,0,29,1],[30,0,31,1],[59,5,59,6],[60,5,60,6],[61,5,61,6]]}
[]
[]
[null,null,null,"محاسبه بار برف",null,null,null,null,null,null,null,null,null,null,null,null,null,1,"آستارا",{"$f":"IF(V3=1,\"منطقه 1\",IF(V3=2,\"منطقه 2\",IF(V3=3,\"منطقه 3\",IF(V3=4,\"منطقه 4\",IF(V3=5,\"منطقه 5\",IF(V3=6,\"منطقه 6\"))))))","v":"منطقه 5"},{"$f":"IF(V3=1,25,IF(V3=2,50,IF(V3=3,100,IF(V3=4,150,IF(V3=5,200,IF(V3=6,300))))))","v":200},5,1]
[null,null,null,null,null,null,null,null,null,null,null,null,null,null,null,null,null,2,"اراك",{"$f":"IF(V4=1,\"منطقه 1\",IF(V4=2,\"منطقه 2\",IF(V4=3,\"منطقه 3\",IF(V4=4,\"منطقه 4\",IF(V4=5,\"منطقه 5\",IF(V4=6,\"منطقه 6\"))))))","v":"منطقه 4"},{"$f":"IF(V4=1,25,IF(V4=2,50,IF(V4=3,100,IF(V4=4,150,IF(V4=5,200,IF(V4=6,300))))))","v":150},4,2]
[null,null,null,null,null,null,null,null,null,null,null,null,null,null,null,null,null,3,"اردبيل",{"$f":"IF(V5=1,\"منطقه 1\",IF(V5=2,\"منطقه 2\",IF(V5=3,\"منطقه 3\",IF(V5=4,\"منطقه 4\",IF(V5=5,\"منطقه 5\",IF(V5=6,\"منطقه 6\"))))))","v":"منطقه 5"},200,5,3]
[null,null,null,"تقسيم بندي مناطق از نظر بار برف",null,null,null,null,null,null,null,null,null,null,null,null,null,4,"اردستان","منطقه 2",50,2,4]
[null,null,null,null,null,null,null,null,null,null,null,null,null,null,null,null,null,5,"اروميه","منطقه 4",150,4,5]
[null,null,null,null,null,"25 دكا نيوتن بر متر مربع",null,"منطقه 1-مناطق با برف نادر",null,null,null,null,null,null,null,null,null,6,"اسلام آباد غرب","منطقه 4",150,4,6]
[null,null,null,null,null,"50 دكا نيوتن بر متر مربع",null,"منطقه2-مناطق با برف كم",null,null,null,null,null,null,null,null,null,7,"اصفهان","منطقه 3",100,3,7]
[null,null,null,null,null,"100 دكا نيوتن بر متر مربع",null,"منطقه 3-مناطق با برف متوسط",null,null,null,null,null,null,null,null,null,8,"اليگودرز","منطقه 5",200,5,8]
[null,null,null,null,null,"150 دكا نيوتن بر متر مربع",null,"منطقه 4-مناطق با برف زياد",null,null,null,null,null,null,null,null,null,9,"اميديه","منطقه 1",25,1,9]
[null,null,null,null,null,"200 دكا نيوتن بر متر مربع",null,"منطقه5-مناطق با برف سنگين",null,null,null,null,null,null,null,null,null,10,"انار","منطقه 2",50,2,10]
[null,null,null,null,null,"300 دكا نيوتن بر متر مربع",null,"منطقه 6-مناطق با برف فوق سنگين",null,null,null,null,null,null,null,null,null,11,"اهر","منطقه 4",150,4,11]
[null,null,null,null,null,null,null,null,null,null,null,null,null,null,null,null,null,12,"اهواز","منطقه 2",50,2,12]
[null,null,null,null,null,null,null,null,null,"بار برف بامها:بار برف بامها از رابطه روبرو تعيين ميشود:",null,null,null,null,null,null,null,13,"ايرانشهر","منطقه 1",25,1,13]
[null,null,null,null,null,null,null,null,null,null,null,null,null,null,null,null,null,14,"ايلام","منطقه 4",150,4,14]
[null,null,null,null,null,null,null,null,null,null,null,null,null,null,null,null,null,15,"ايوان غرب","منطقه 3",100,3,15]
[null,null,null,null,null,"تعيين بار برف مبنا (Ps)",null,null,null,null,null,null,null,null,null,null,null,16,"آبادان","منطقه 2",50,2,16]
[null,null,null,null,null,null,null,null,null,null,null,null,null,null,null,null,null,17,"آباده","منطقه 3",100,3,17]
[null,null,null,"شهر مورد نظر",null,"نوع منطقه",null,null,"بار برف مبنا",null,null,null,null,null,null,null,null,18,"آبعلي","منطقه 5",200,5,18]
[null,null,null,null,null,null,null,null,null,null,null,null,null,null,null,null,null,19,"آستارا","منطقه 5",200,5,19]
[null,null,null,{"$f":"CHOOSE(I56,S3,S4,S5,S6,S7,S8,S9,S10,S11,S12,S13,S14,S15,S16,S17,S18,S19,S20,S21,S22,S23,S24,S25,S26,S27,S28,S29,S30,S31,S32,S33,S34,S35,S36,S37,S38,S39,S40,S41,S42,S43,S44,S45,S46,S47,S48,S49,S50,S51,S52,S53,S54,S55,S56,S57,S58,S59,S60,S61,S62,S63,S64,S65,S66,S67,S68,S69,S70,S71,S72,S73,S74,S75,S76,S77,S78,S79,S80,S81,S82,S83,S84,S85,S86,S87,S88,S89,S90,S91,S92,S93,S94,S95,S96,S97,S98,S99,S100,S101,S102,S103,S104,S105,S106,S107,S108,S109,S110,S111,S112,S113,S114,S115,S116,S117,S118,S119,S120,S121,S122)","v":"گناباد"},null,{"$f":"CHOOSE(I56,T3,T4,T5,T6,T7,T8,T9,T10,T11,T12,T13,T14,T15,T16,T17,T18,T19,T20,T21,T22,T23,T24,T25,T26,T27,T28,T29,T30,T31,T32,T33,T34,T35,T36,T37,T38,T39,T40,T41,T42,T43,T44,T45,T46,T47,T48,T49,T50,T51,T52,T53,T54,T55,T56,T57,T58,T59,T60,T61,T62,T63,T64,T65,T66,T67,T68,T69,T70,T71,T72,T73,T74,T75,T76,T77,T78,T79,T80,T81,T82,T83,T84,T85,T86,T87,T88,T89,T90,T91,T92,T93,T94,T95,T96,T97,T98,T99,T100,T101,T102,T103,T104,T105,T106,T107,T108,T109,T110,T111,T112,T113,T114,T115,T116,T117,T118,T119,T120,T121,T122)","v":"منطقه 2"},null,null,{"$f":"CHOOSE(I56,U3,U4,U5,U6,U7,U8,U9,U10,U11,U12,U13,U14,U15,U16,U17,U18,U19,U20,U21,U22,U23,U24,U25,U26,U27,U28,U29,U30,U31,U32,U33,U34,U35,U36,U37,U38,U39,U40,U41,U42,U43,U44,U45,U46,U47,U48,U49,U50,U51,U52,U53,U54,U55,U56,U57,U58,U59,U60,U61,U62,U63,U64,U65,U66,U67,U68,U69,U70,U71,U72,U73,U74,U75,U76,U77,U78,U79,U80,U81,U82,U83,U84,U85,U86,U87,U88,U89,U90,U91,U92,U93,U94,U95,U96,U97,U98,U99,U100,U101,U102,U103,U104,U105,U106,U107,U108,U109,U110,U111,U112,U113,U114,U115,U116,U117,U118,U119,U120,U121,U122)","v":50},null,null,null,null,null,null,null,null,20,"انزلي","منطقه 4",150,4,20]
[null,null,null,null,null,null,null,null,null,null,null,null,null,null,null,null,null,21,"بافت","منطقه 3",100,3,21]
[null,null,null,null,null,null,null,null,null,null,null,null,null,null,null,null,null,22,"بافق","منطقه 2",50,2,22]
[null,null,null,null,null,"تعيين ضريب اثر شيب (Cs)",null,null,null,null,null,null,null,null,null,null,null,23,"بانه","منطقه 5",200,5,23]
[null,null,null,null,null,null,null,null,null,null,null,null,null,null,null,null,null,24,"بجنورد","منطقه 4",150,4,24]
[null,null,null,"Cs",null,null,null,null,null,"نوع بام",null,null,null,null,null,null,null,25,"بروجرد","منطقه 4",150,4,25]
["زاويه بام (در حالتي كه زاويه بين 15 و 60 درجه است)",null,null,"3-شيبدار با شيب بيشتر از 60 درجه",null,"2-شيبدار بازاويه بين 15 درجه و 60 درجه",null,"1-مسطح و شيبدار با شيب كمتر از 15 درجه",null,"الف:بام مسطح و شيب دار",null,null,null,null,null,null,null,26,"بستان","منطقه 2",50,2,26]
[null,null,null,null,null,null,null,null,null,null,null,null,null,null,null,null,null,27,"بشرويه","منطقه 2",50,2,27]
[null,null,null,"Cs=.25",null,null,null,"Cs=1",null,null,null,null,null,null,null,null,null,28,"بم","منطقه 2",50,2,28]
[45,null,null,null,null,null,null,null,null,null,null,null,null,null,null,null,null,29,"بندرعباس","منطقه 1",25,1,29]
[null,null,null,"در بامهاي شيبدار دندانه اي ضريب اثر شيب براي كليه سطوح Cs=1 است.",null,null,null,null,null,"ب-بام شيبدار دندانه اي",null,null,null,null,null,null,null,30,"بندر لنگه","منطقه 1",25,1,30]
[null,null,null,null,null,null,null,null,null,null,null,null,null,null,null,null,null,31,"بوشهر","منطقه 1",25,1,31]
[null,null,null,null,null,null,null,null,null,null,null,null,null,null,null,null,null,32,"بيجار","منطقه 4",150,4,32]
[null,null,null,"دربامهاي قوسي ضريب اثر شيب بايد با توجه به شيب قوس در طول آن تعيين گردد.",null,null,null,null,null,"ج-بام قوسي",null,null,null,null,null,null,null,33,"بيرجند","منطقه 2",50,2,33]
[null,null,null,null,null,null,null,null,null,null,null,null,null,null,null,null,null,34,"پيرانشهر","منطقه 5",200,5,34]
[null,null,null,null,null,null,null,null,null,null,null,null,null,null,null,null,null,35,"تبريز","منطقه 4",150,4,35]
[null,null,null,null,null,null,null,null,null,null,null,null,null,null,null,null,null,36,"تربت جام","منطقه 4",150,4,36]
[null,null,null,"نوع بام",null,null,null,"Cs",null,null,null,null,null,null,null,null,null,37,"تربت حيدريه","منطقه 3",100,3,37]
[null,null,null,null,null,null,null,null,null,null,null,null,null,null,null,null,null,38,"تكاب","منطقه 4",150,4,38]
[null,null,null,{"$f":"IF(F60=1,F61,IF(F60=2,F62,IF(F60=3,F63,IF(F60=4,F64,IF(F60=5,F65)))))","v":"مسطح و شيبدار با شيب كمتر از 15 درجه"},null,null,null,{"$f":"IF(F60=1,1,IF(F60=2,F66,IF(F60=3,0.25,IF(F60=4,1,IF(F60=5,\"با توجه به شيب قوس تعيين شود.\")))))","v":1},null,null,null,null,null,null,null,null,null,39,"تهران مهرآباد","منطقه 4",150,4,39]
[null,null,null,null,null,null,null,null,null,null,null,null,null,null,null,null,null,40,"تهران شمال","منطقه 4",150,4,40]
[null,null,null,null,null,null,null,null,null,null,null,null,null,null,null,null,null,41,"جاسك","منطقه 1",25,1,41]
[null,null,null,null,null,null,null,null,null,null,null,null,null,null,null,null,null,42,"جلفا","منطقه 4",150,4,42]
[null,null,null,null,null,null,{"$f":"ROUND(H41*I22,3)","v":50},null,null,null,null,null,null,null,null,null,null,43,"جيرفت","منطقه 2",50,2,43]
[null,null,null,null,null,null,null,null,null,null,null,null,null,null,null,null,null,44,"چابهار","منطقه 1",25,1,44]
[null,null,null,null,null,null,null,null,null,null,null,null,null,null,null,null,null,45,"خاش","منطقه 1",25,1,45]
[null,null,null,null,null,null,null,null,null,null,null,null,null,null,null,null,null,46,"خدابنده","منطقه 4",150,4,46]
[null,null,null,null,null,null,null,null,null,null,null,null,null,null,null,null,null,47,"خرم آباد","منطقه 4",150,4,47]
[null,null,null,null,null,null,null,null,null,null,null,null,null,null,null,null,null,48,"خرم دره","منطقه 4",150,4,48]
[null,null,null,null,null,null,null,null,null,null,null,null,null,null,null,null,null,49,"خلخال","منطقه 5",200,5,49]
[null,null,null,null,null,null,null,null,null,null,null,null,null,null,null,null,null,50,"خور بيابانك","منطقه 1",25,1,50]
[null,null,null,null,null,null,null,null,null,null,null,null,null,null,null,null,null,51,"خور بيرجند","منطقه 2",50,2,51]
[null,null,null,null,null,null,null,null,null,null,null,null,null,null,null,null,null,52,"خوي","منطقه 4",150,4,52]
[null,null,null,null,null,null,null,null,null,null,null,null,null,null,null,null,null,53,"داران","منطقه 5",200,5,53]
[null,null,null,null,null,null,null,null,103,null,null,null,null,null,null,null,null,54,"درود","منطقه 5",200,5,54]
[null,null,null,null,null,null,null,null,null,null,null,null,null,null,null,null,null,55,"دزفول","منطقه 3",100,3,55]
[null,null,null,null,null,null,null,null,null,null,null,null,null,null,null,null,null,56,"دهلران","منطقه 3",100,3,56]
[null,null,null,null,null,null,null,null,null,null,null,null,null,null,null,null,null,57,"دوگنبدان","منطقه 2",50,2,57]
[null,null,null,null,null,1,null,null,null,null,null,null,null,null,null,null,null,58,"رامسر","منطقه 4",150,4,58]
[null,null,null,null,null,"مسطح و شيبدار با شيب كمتر از 15 درجه",null,null,null,null,null,null,null,null,null,null,null,59,"رامهرمز","منطقه 2",50,2,59]
[null,null,null,null,null,"شيبدار بازاويه بين 15 درجه و 60 درجه",null,null,null,null,null,null,null,null,null,null,null,60,"رباط پشت بام","منطقه 2",50,2,60]
[null,null,null,null,null,"شيبدار با شيب بيشتر از 60 درجه",null,null,null,null,null,null,null,null,null,null,null,61,"رشت","منطقه 5",200,5,61]
[null,null,null,null,null,"بام شيبدار دندانه اي",null,null,null,null,null,null,null,null,null,null,null,62,"رفسنجان","منطقه 3",100,3,62]
[null,null,null,null,null,"بام قوسي",null,null,null,null,null,null,null,null,null,null,null,63,"روانسر","منطقه 4",150,4,63]
[null,null,null,null,null,{"$f":"1-((A31-15)/60)","v":0.5},null,null,null,null,null,null,null,null,null,null,null,64,"زابل","منطقه 2",50,2,64]
[null,null,null,null,null,null,null,null,null,null,null,null,null,null,null,null,null,65,"زرينه اوباتو","منطقه 5",200,5,65]
[null,null,null,null,null,null,null,null,null,null,null,null,null,null,null,null,null,66,"زنجان ","منطقه 4",{"$f":"IF(V68=1,25,IF(V68=2,50,IF(V68=3,100,IF(V68=4,150,IF(V68=5,200,IF(V68=6,300))))))","v":150},4,66]
[null,null,null,null,null,null,null,null,null,null,null,null,null,null,null,null,null,67,"سبزوار",{"$f":"IF(V69=1,\"منطقه 1\",IF(V69=2,\"منطقه 2\",IF(V69=3,\"منطقه 3\",IF(V69=4,\"منطقه 4\",IF(V69=5,\"منطقه 5\",IF(V69=6,\"منطقه 6\"))))))","v":"منطقه 3"},100,3,67]
[null,null,null,null,null,null,null,null,null,null,null,null,null,null,null,null,null,68,"سراب","منطقه 4",150,4,68]
[null,null,null,null,null,null,null,null,null,null,null,null,null,null,null,null,null,69,"سراوان","منطقه 1",25,1,69]
[null,null,null,null,null,null,null,null,null,null,null,null,null,null,null,null,null,70,"سرپل ذهاب","منطقه 3",100,3,70]
[null,null,null,null,null,null,null,null,null,null,null,null,null,null,null,null,null,71,"سرخس","منطقه 3",100,3,71]
[null,null,null,null,null,null,null,null,null,null,null,null,null,null,null,null,null,72,"سردشت","منطقه 6",300,6,72]
[null,null,null,null,null,null,null,null,null,null,null,null,null,null,null,null,null,73,"سقز","منطقه 5",200,5,73]
[null,null,null,null,null,null,null,null,null,null,null,null,null,null,null,null,null,74,"سمنان","منطقه 3",100,3,74]
[null,null,null,null,null,null,null,null,null,null,null,null,null,null,null,null,null,75,"سنندج","منطقه 4",150,4,75]
[null,null,null,null,null,null,null,null,null,null,null,null,null,null,null,null,null,76,"سيرجان","منطقه 4",150,4,76]
[null,null,null,null,null,null,null,null,null,null,null,null,null,null,null,null,null,77,"شاهرود","منطقه 3",100,3,77]
[null,null,null,null,null,null,null,null,null,null,null,null,null,null,null,null,null,78,"شهر بابك","منطقه 3",100,3,78]
[null,null,null,null,null,null,null,null,null,null,null,null,null,null,null,null,null,79,"شهر كرد","منطقه 4",150,4,79]
[null,null,null,null,null,null,null,null,null,null,null,null,null,null,null,null,null,80,"شيراز","منطقه 3",100,3,80]
[null,null,null,null,null,null,null,null,null,null,null,null,null,null,null,null,null,81,"طبس","منطقه 2",50,2,81]
[null,null,null,null,null,null,null,null,null,null,null,null,null,null,null,null,null,82,"فردوس","منطقه 2",50,2,82]
[null,null,null,null,null,null,null,null,null,null,null,null,null,null,null,null,null,83,"فسا","منطقه 3",100,3,83]
[null,null,null,null,null,null,null,null,null,null,null,null,null,null,null,null,null,84,"فيروزكوه","منطقه 4",150,4,84]
[null,null,null,null,null,null,null,null,null,null,null,null,null,null,null,null,null,85,"قائن","منطقه 2",50,2,85]
[null,null,null,null,null,null,null,null,null,null,null,null,null,null,null,null,null,86,"قراخيل","منطقه 4",150,4,86]
[null,null,null,null,null,null,null,null,null,null,null,null,null,null,null,null,null,87,"قروه","منطقه 4",150,4,87]
[null,null,null,null,null,null,null,null,null,null,null,null,null,null,null,null,null,88,"قزوين","منطقه 4",150,4,88]
[null,null,null,null,null,null,null,null,null,null,null,null,null,null,null,null,null,89,"قم","منطقه 3",100,3,89]
[null,null,null,null,null,null,null,null,null,null,null,null,null,null,null,null,null,90,"قوچان","منطقه 4",150,4,90]
[null,null,null,null,null,null,null,null,null,null,null,null,null,null,null,null,null,91,"كاشان","منطقه 3",100,3,91]
[null,null,null,null,null,null,null,null,null,null,null,null,null,null,null,null,null,92,"كاشمر","منطقه 2",50,2,92]
[null,null,null,null,null,null,null,null,null,null,null,null,null,null,null,null,null,93,"كرج","منطقه 4",150,4,93]
[null,null,null,null,null,null,null,null,null,null,null,null,null,null,null,null,null,94,"كرمان","منطقه 3",100,3,94]
[null,null,null,null,null,null,null,null,null,null,null,null,null,null,null,null,null,95,"كرمانشاه","منطقه 4",150,4,95]
[null,null,null,null,null,null,null,null,null,null,null,null,null,null,null,null,null,96,"كنگاور","منطقه 4",150,4,96]
[null,null,null,null,null,null,null,null,null,null,null,null,null,null,null,null,null,97,"كهنوج","منطقه 1",25,1,97]
[null,null,null,null,null,null,null,null,null,null,null,null,null,null,null,null,null,98,"كوهرنگ","منطقه 6",300,6,98]
[null,null,null,null,null,null,null,null,null,null,null,null,null,null,null,null,null,99,"گرگان","منطقه 3",100,3,99]
[null,null,null,null,null,null,null,null,null,null,null,null,null,null,null,null,null,100,"گرمسار","منطقه 3",100,3,100]
[null,null,null,null,null,null,null,null,null,null,null,null,null,null,null,null,null,101,"گلپايگان","منطقه 5",200,5,101]
[null,null,null,null,null,null,null,null,null,null,null,null,null,null,null,null,null,102,"گلمكان","منطقه 4",150,4,102]
[null,null,null,null,null,null,null,null,null,null,null,null,null,null,null,null,null,103,"گناباد","منطقه 2",50,2,103]
[null,null,null,null,null,null,null,null,null,null,null,null,null,null,null,null,null,104,"لار","منطقه 1",25,1,104]
[null,null,null,null,null,null,null,null,null,null,null,null,null,null,null,null,null,105,"ماكو","منطقه 4",150,4,105]
[null,null,null,null,null,null,null,null,null,null,null,null,null,null,null,null,null,106,"مراغه","منطقه 4",150,4,106]
[null,null,null,null,null,null,null,null,null,null,null,null,null,null,null,null,null,107,"مريوان","منطقه 5",200,5,107]
[null,null,null,null,null,null,null,null,null,null,null,null,null,null,null,null,null,108,"مسجد سليمان","منطقه 3",100,3,108]
[null,null,null,null,null,null,null,null,null,null,null,null,null,null,null,null,null,109,"مشهد","منطقه 4",150,4,109]
[null,null,null,null,null,null,null,null,null,null,null,null,null,null,null,null,null,110,"ملاير","منطقه 4",150,4,110]
[null,null,null,null,null,null,null,null,null,null,null,null,null,null,null,null,null,111,"مهاباد","منطقه 4",150,4,111]
[null,null,null,null,null,null,null,null,null,null,null,null,null,null,null,null,null,112,"ميانه","منطقه 4",150,4,112]
[null,null,null,null,null,null,null,null,null,null,null,null,null,null,null,null,null,113,"نائيين","منطقه 2",50,2,113]
[null,null,null,null,null,null,null,null,null,null,null,null,null,null,null,null,null,114,"نهاوند","منطقه 4",150,4,114]
[null,null,null,null,null,null,null,null,null,null,null,null,null,null,null,null,null,115,"نهبندان","منطقه 2",50,2,115]
[null,null,null,null,null,null,null,null,null,null,null,null,null,null,null,null,null,116,"نيشابور","منطقه 4",150,4,116]
[null,null,null,null,null,null,null,null,null,null,null,null,null,null,null,null,null,117,"همدان فرودگاه","منطقه 4",150,4,117]
[null,null,null,null,null,null,null,null,null,null,null,null,null,null,null,null,null,118,"همدان نوژه","منطقه 4",150,4,118]
[null,null,null,null,null,null,null,null,null,null,null,null,null,null,null,null,null,119,"ياسوج","منطقه 4",150,4,119]
[null,null,null,null,null,null,null,null,null,null,null,null,null,null,null,null,null,120,"يزد","منطقه 2",50,2,120]

{"sheet":"بار زنده","index":19,"n_rows":126,"n_cols":10,"rows_kept":126,"cut":false,"hidden":false,"merged":[[30,3,31,8],[30,9,31,10],[28,3,29,8],[28,9,29,10],[20,3,21,4],[22,3,23,4],[12,3,13,4],[14,3,15,4],[16,3,17,4],[18,3,19,4],[16,9,17,10],[18,9,19,10],[20,9,21,10],[22,5,23,8],[22,9,23,10],[26,3,27,10],[16,5,17,8],[18,5,19,8],[20,5,21,8],[6,9,7,10],[8,9,9,10],[10,9,11,10],[12,9,13,10],[14,9,15,10],[2,3,3,10],[4,9,5,10],[6,3,7,4],[8,3,9,4],[10,3,11,4],[8,5,9,8],[10,5,11,8],[6,5,7,8],[12,5,13,8],[14,5,15,8],[4,3,5,8],[18,0,19,1],[20,0,21,1],[22,0,23,1],[26,0,27,1],[28,0,29,1],[30,0,31,1],[6,0,7,1],[8,0,9,1],[10,0,11,1],[12,0,13,1],[14,0,15,1],[16,0,17,1],[56,2,56,8],[56,9,56,11],[57,2,57,8],[57,9,57,11],[58,2,58,8],[58,9,58,11],[52,2,53,8],[52,9,53,11],[54,2,54,8],[54,9,54,11],[55,2,55,8],[55,9,55,11],[62,2,62,8],[62,9,62,11],[63,2,63,8],[63,9,63,11],[64,2,64,8],[64,9,64,11],[59,2,59,8],[59,9,59,11],[60,2,60,8],[60,9,60,11],[61,2,61,8],[61,9,61,11],[67,2,67,8],[68,2,68,8],[69,2,69,8],[70,2,70,8],[71,2,71,8],[65,2,65,8],[65,9,65,11],[66,2,66,8],[66,9,66,11],[67,9,67,11],[68,9,68,11],[72,2,73,8],[72,9,73,11],[74,2,74,8],[74,9,74,11],[75,2,75,8],[75,9,75,11],[69,9,69,11],[70,9,70,11],[71,9,71,11],[79,9,79,11],[80,9,80,11],[81,9,81,11],[82,9,82,11],[83,9,83,11],[84,9,84,11],[76,2,77,8],[76,9,77,11],[78,2,78,8],[78,9,78,11],[79,2,79,8],[80,2,80,8],[85,2,86,8],[85,9,86,11],[87,2,87,8],[87,9,87,11],[88,2,88,8],[88,9,88,11],[81,2,81,8],[82,2,82,8],[83,2,83,8],[84,2,84,8],[93,2,93,8],[93,9,93,11],[94,2,94,8],[94,9,94,11],[95,2,96,8],[95,9,96,11],[89,2,89,8],[89,9,89,11],[90,2,91,8],[90,9,91,11],[92,2,92,8],[92,9,92,11],[100,2,101,8],[100,9,101,11],[102,2,102,8],[102,9,102,11],[107,2,107,8],[97,2,97,8],[97,9,97,11],[98,2,98,8],[98,9,98,11],[99,2,99,8],[99,9,99,11],[108,2,108,8],[109,2,110,8],[109,9,110,11],[111,2,111,8],[111,9,111,11],[112,2,112,8],[112,9,112,11],[103,2,103,8],[103,9,103,11],[104,2,105,8],[104,9,105,11],[106,2,106,8],[106,9,106,11],[107,9,107,11],[108,9,108,11],[118,2,118,8],[118,9,118,11],[119,2,119,8],[119,9,119,11],[120,2,120,8],[120,9,120,11],[114,2,115,8],[114,9,115,11],[116,2,116,8],[116,9,116,11],[117,2,117,8],[117,9,117,11],[124,2,124,8],[124,9,124,11],[125,2,125,8],[125,9,125,11],[121,2,121,8],[121,9,121,11],[122,2,122,8],[122,9,122,11],[123,2,123,8],[123,9,123,11]]}
[]
[]
[null,null,null,"حداقل بارهاي زنده گسترده يكنواخت"]
[]
[null,null,null,"نوع كاربري كف",null,null,null,null,null,"بار گسترده"]
[]
[3,null,null,"1-كاربري هاي مشترك",null,{"$f":"CHOOSE(A7,C55,C56,C57,C58,C59,C60,C61,C62,C63,C64,C65,C66,C67,C68,C69,C70)","v":"بامهاي تخت و يا با شيب كم كه به عنوان محل تجمع مورد استفاده قرار نميگيرد"},null,null,null,{"$f":"CHOOSE(A7,J55,J56,J57,J58,J59,J60,J61,J62,J63,J64,J65,J66,J67,J68,J69,J70)","v":150}]
[]
[1,null,null,"2-ساختمانهاي مسكوني",null,{"$f":"CHOOSE(A9,C75,C76)","v":"اتاقها و راهروهاي خصوصي و سرويس ها"},null,null,null,{"$f":"CHOOSE(A9,J75,J76)","v":200}]
[]
[4,null,null,"3-اماكن عمومي",null,{"$f":"CHOOSE(A11,C79,C80,C81,C82,C83,C84,C85)","v":"سينماها و تئاترها"},null,null,null,{"$f":"CHOOSE(A11,J79,J80,J81,J82,J83,J84,J85)","v":500}]
[]
[1,null,null,"4-ساختمانهاي اداري",null,{"$f":"CHOOSE(A13,C88,C89,C90)","v":"دفاتر كار معمولي"},null,null,null,{"$f":"CHOOSE(A13,J88,J89,J90)","v":250}]
[]
[1,null,null,"5-ساختمانهاي آموزشي",null,{"$f":"CHOOSE(A15,C93,C94,C95)","v":"كلاس هاي درس و آزمايشگاههاي سبك و قرائت خانه ها"},null,null,null,{"$f":"CHOOSE(A15,J93,J94,J95)","v":350}]
[]
[1,null,null,"6-ساختمانهاي صنعتي",null,{"$f":"CHOOSE(A17,C98,C99,C100)","v":"كارگاههاي سبك صنعتي"},null,null,null,{"$f":"CHOOSE(A17,J98,J99,J100)","v":600}]
[]
[1,null,null,"7-فروشگاهها",null,{"$f":"CHOOSE(A19,C103,C104)","v":"كف تمام طبقات غير از انبارها"},null,null,null,{"$f":"CHOOSE(A19,J103,J104)","v":500}]
[]
[1,null,null,"8-ورزشگاهها",null,{"$f":"CHOOSE(A21,C107,C108,C109)","v":"سالنهاي تمرينات بدني و ورزشي"},null,null,null,{"$f":"CHOOSE(A21,J107,J108,J109)","v":500}]
[]
[1,null,null,"9-مراكز درماني",null,{"$f":"CHOOSE(A23,C112,C113)","v":"اتاقهاي بيمار"},null,null,null,{"$f":"CHOOSE(A23,J112,J113)","v":200}]
[]
[]
[]
[null,null,null,"حداقل بارهاي زنده متمركز"]
[]
[null,null,null,"نوع كاربري كف",null,null,null,null,null,"بار گسترده"]
[]
[7,null,null,{"$f":"CHOOSE(A31,C117,C118,C119,C120,C121,C122,C123,C124,C125,C126)","v":"محل عبور يا پارك خودروهاي سواري با وزن حداكثر 2500 دكا نيوتن"},null,null,null,null,null,{"$f":"CHOOSE(A31,J117,J118,J119,J120,J121,J122,J123,J124,J125,J126)","v":1000}]
[]
[]
[]
[]
[]
[]
[]
[]
[]
[]
[]
[]
[]
[]
[]
[]
[]
[]
[]
[]
[]
[null,null,"مشترك",null,null,null,null,null,null,"بار گسترده"]
[]
[null,null,"بامهاي شيبدار با پوشش سبك با شيب بيشتر از 10 درجه",null,null,null,null,null,null,"-"]
[null,null,"بامهاي شيبدار با پوشش سبك با شيب كمتر از 10 درجه",null,null,null,null,null,null,50]
[null,null,"بامهاي تخت و يا با شيب كم كه به عنوان محل تجمع مورد استفاده قرار نميگيرد",null,null,null,null,null,null,150]
[null,null,"سالنهاي عمومي و محلهاي تجمع داراي صندلي ثابت",null,null,null,null,null,null,400]
[null,null,"سالنهاي عمومي و محلهاي تجمع بدون صندلي ثابت",null,null,null,null,null,null,500]
[null,null,"راهروهاي فرعي بين اتاقها كه امكان تجمع در آنها كم باشد",null,null,null,null,null,null,"مطابق بار زنده اتاق مجاور"]
[null,null,"راهروهاي اصلي و پلكان ها كه در معرض رفت و آمد و تجمع كم باشد نظير ساختمانهاي مسكوني و اداري",null,null,null,null,null,null,350]
[null,null,"راهروهاي اصلي و پلكان ها كه در معرض رفت و آمد و تجمع زياد باشد نظير مدارس و مركز تجمع",null,null,null,null,null,null,500]
[null,null,"بالكنها",null,null,null,null,null,null,"حداقل 300 و در صورت تجمع 500"]
[null,null,"موتورخانه ها",null,null,null,null,null,null,750]
[null,null,"اتاقهاي هواسازو پمپ و نظاير آن",null,null,null,null,null,null,500]
[null,null,"محل عبور و پارك خودروهاي سواري با وزن حداكثر 1500 دكا نيوتن",null,null,null,null,null,null,350]
[null,null,"محل عبور و پارك خودروهاي سواري با وزن حداكثر 2500 دكا نيوتن",null,null,null,null,null,null,500]
[null,null,"محل عبور و پارك خودروهاي سواري و كاميونت هاي با وزن حداكثر 4000 دكا نيوتن",null,null,null,null,null,null,600]
[null,null,"محل عبور و پارك خودروها با وزن حداكثر 600 دكا نيوتن",null,null,null,null,null,null,700]
[null,null,"محل عبور و پارك خودروها با وزن حداكثر 9000 دكا نيوتن",null,null,null,null,null,null,800]
[]
[]
[null,null,"مسكوني",null,null,null,null,null,null,"بار گسترده"]
[]
[null,null,"اتاقها و راهروهاي خصوصي و سرويس ها",null,null,null,null,null,null,200]
[null,null,"انبارها",null,null,null,null,null,null,500]
[null,null,"اماكن عمومي",null,null,null,null,null,null,"بار گسترده"]
[]
[null,null,"اتاقهاي خواب و اقامت در هتل ها",null,null,null,null,null,null,200]
[null,null,"سالنهاي غذاخوري و رستورانها",null,null,null,null,null,null,500]
[null,null,"شبستان مساجد و تكايا",null,null,null,null,null,null,600]
[null,null,"سينماها و تئاترها",null,null,null,null,null,null,500]
[null,null,"صحنه هاي سينما و تئاترها",null,null,null,null,null,null,750]
[null,null,"پايانه ها",null,null,null,null,null,null,600]
[null,null,"آشپزخانه و رخت شويخانه ها",null,null,null,null,null,null,500]
[null,null,"اداري",null,null,null,null,null,null,"بار گسترده"]
[]
[null,null,"دفاتر كار معمولي",null,null,null,null,null,null,250]
[null,null,"اتاقهاي بايگاني با قفسه ثابت",null,null,null,null,null,null,500]
[null,null,"اتاقهاي بايگاني با قفسه متحرك",null,null,null,null,null,null,1000]
[null,null,"آموزشي",null,null,null,null,null,null,"بار گسترده"]
[]
[null,null,"كلاس هاي درس و آزمايشگاههاي سبك و قرائت خانه ها",null,null,null,null,null,null,350]
[null,null,"مخازن كتاب با قفسه ثابت",null,null,null,null,null,null,"250 به ازاي هر متر ارتفاع مفيد حداقل 750"]
[null,null,"مخازن كتاب با قفسه متحرك",null,null,null,null,null,null,"450 به ازاي هر متر ارتفاع مفيد حداقل 1000"]
[null,null,"صنعتي",null,null,null,null,null,null,"بار گسترده"]
[]
[null,null,"كارگاههاي سبك صنعتي",null,null,null,null,null,null,600]
[null,null,"كارگاههاي متوسط صنعتي",null,null,null,null,null,null,1000]
[null,null,"سردخانه ها",null,null,null,null,null,null,"500 به ازاي هر متر ارتفاع مفيد حداقل 1500"]
[null,null,"فروشگاهها",null,null,null,null,null,null,"بار گسترده"]
[]
[null,null,"كف تمام طبقات غير از انبارها",null,null,null,null,null,null,500]
[null,null,"انبارها",null,null,null,null,null,null,"با توجه به مواد انبار شده حداقل 750"]
[null,null,"ورزشگاها",null,null,null,null,null,null,"بار گسترده"]
[]
[null,null,"سالنهاي تمرينات بدني و ورزشي",null,null,null,null,null,null,500]
[null,null,"سكوهاي تماشاچيان با صندلي ثابت",null,null,null,null,null,null,500]
[null,null,"سكوهاي تماشاچيان بدون صندلي ثابت",null,null,null,null,null,null,600]
[null,null,"مراكز درماني",null,null,null,null,null,null,"بار گسترده"]
[]
[null,null,"اتاقهاي بيمار",null,null,null,null,null,null,200]
[null,null,"اتاقهاي عمل",null,null,null,null,null,null,300]
[]
[null,null,"بار متمركز",null,null,null,null,null,null,"بار گسترده"]
[]
[null,null,"بامها",null,null,null,null,null,null,100]
[null,null,"كلاسها",null,null,null,null,null,null,450]
[null,null,"دفاتر كار اتاقهاي عمل و صحنه ها",null,null,null,null,null,null,900]
[null,null,"انبارها",null,null,null,null,null,null,900]
[null,null,"مخازن كتاب",null,null,null,null,null,null,700]
[null,null,"محل عبور يا پارك خودروهاي سواري با وزن حداكثر 1500 دكا نيوتن",null,null,null,null,null,null,750]
[null,null,"محل عبور يا پارك خودروهاي سواري با وزن حداكثر 2500 دكا نيوتن",null,null,null,null,null,null,1000]
[null,null,"محل عبور يا پارك خودروهاي سواري با وزن حداكثر 4000 دكا نيوتن",null,null,null,null,null,null,2000]
[null,null,"محل عبور يا پارك خودروهاي سواري با وزن حداكثر 6000 دكا نيوتن",null,null,null,null,null,null,3000]
[null,null,"محل عبور يا پارك خودروهاي سواري با وزن حداكثر 9000 دكا نيوتن",null,null,null,null,null,null,4000]

{"sheet":"ضريب زلزله X","index":20,"n_rows":84,"n_cols":17,"rows_kept":84,"cut":false,"hidden":false,"merged":[[67,11,67,13],[68,11,68,13],[15,8,15,9],[16,8,16,9],[17,8,17,9],[18,8,18,9],[20,7,20,8],[21,7,21,8],[22,7,22,8],[57,8,57,10],[15,6,15,7],[25,4,26,11],[64,11,64,13],[16,4,16,5],[22,4,22,5],[16,6,16,7],[17,6,17,7],[65,11,65,13],[66,11,66,13],[62,8,62,10],[58,8,58,10],[59,8,59,10],[60,8,60,10],[21,10,21,11],[58,4,58,6],[57,4,57,6],[59,4,59,6],[60,4,60,6],[28,8,29,8],[18,6,18,7],[13,4,13,6],[13,9,13,11],[14,4,14,6],[14,9,14,11],[14,7,14,8],[2,4,3,11],[7,4,7,11],[8,4,8,11],[9,6,9,10],[61,4,61,6],[61,8,61,10],[5,6,5,10],[6,6,6,10],[10,6,10,10],[12,4,12,11],[5,4,5,5],[6,4,6,5],[10,4,10,5],[9,4,9,5],[20,4,20,5],[21,4,21,5]]}
[]
[]
[null,null,null,null,"محاسبه ضريب زلزله در جهت X"]
[]
[]
[null,1,null,null,"شتاب مبنا",null,{"$f":"CHOOSE(B6,I59,I60,I61,I62)","v":"پهنه با خطر نسبي خيلي زياد"},null,null,null,null,{"$f":"CHOOSE(B6,H59,H60,H61,H62)","v":0.35}]
[null,3,null,null,"ضريب اهميت ساختمان",null,{"$f":"CHOOSE(B7,E59,E60,E61,E62)","v":"ساختمان با اهميت متوسط"},null,null,null,null,{"$f":"CHOOSE(B7,D59,D60,D61,D62)","v":1}]
[]
[null,null,null,null,"ضريب رفتار سازه"]
[null,null,null,null,"سيستم سازه",null,"سيستم مقاوم در برابر نيروهاي جانبي",null,null,null,null,"R"]
[null,{"$f":"E72","v":2},null,null,{"$f":"CHOOSE(B11,F65,F66,F67,F68)","v":"قاب ساختماني ساده"},null,{"$f":"CHOOSE(N11,G78,G79,G80,G81,G82,G83,G84)","v":"ديوار برشي بتن آرمه متوسط"},null,null,null,null,{"$f":"IF(AND(B11=1,N11=1),7,IF(AND(B11=1,N11=2),6,IF(AND(B11=1,N11=3),5,IF(AND(B11=1,N11=4),4,IF(AND(B11=2,N11=1),8,IF(AND(B11=2,N11=2),7,IF(AND(B11=2,N11=3),5,IF(AND(B11=2,N11=4),4,IF(AND(B11=2,N11=5),7,IF(AND(B11=2,N11=6),6,IF(AND(B11=3,N11=1),10,IF(AND(B11=3,N11=2),7,IF(AND(B11=3,N11=3),4,IF(AND(B11=3,N11=4),10,IF(AND(B11=3,N11=5),7,IF(AND(B11=3,N11=6),5,IF(AND(B11=4,N11=1),11,IF(AND(B11=4,N11=2),8,IF(AND(B11=4,N11=3),8,IF(AND(B11=4,N11=4),10,IF(AND(B11=4,N11=5),9,IF(AND(B11=4,N11=6),7,IF(AND(B11=4,N11=7),7)))))))))))))))))))))))","v":7},null,{"$f":"H74","v":2}]
[]
[null,null,null,null,"ضريب بازتاب سازه"]
[null,2,null,null,"ارتفاع ساختمان از تراز پايه",null,null,25,"نوع زمين",{"$f":"CHOOSE(B14,Q59,Q60,Q61,Q62)","v":"تيپ2"}]
[null,5,null,null,"زمان تناوب اصلي نوسان (T)",null,null,"نوع سيستم",null,{"$f":"CHOOSE(B15,L65,L66,L67,L68,L69)","v":"ساير سيستم ها"}]
[null,null,null,null,null,null,"T=",null,{"$f":"CHOOSE(B15,O65,O66,O67,O68,O69)","v":0.55900000000000005}]
[null,null,null,null,null,null,"T0=",null,{"$f":"CHOOSE(B14,P59,P60,P61,P62)","v":0.1}]
[null,null,null,null,null,null,"Ts=",null,{"$f":"CHOOSE(B14,O59,O60,O61,O62)","v":0.5}]
[null,null,null,null,null,null,"S=",null,{"$f":"CHOOSE(B14,N59,N60,N61,IF(B6>2,2.25,IF(B6<=2,1.75)))","v":1.5}]
[]
[null,null,null,null,null,null,null,"0≤T≤T0"]
[null,null,null,null,"B=S+1",null,null,"T0≤T≤Ts",null,null,{"$f":"ROUND(IF(K74=TRUE,L74,IF(K75=TRUE,L75,IF(K76=TRUE,L76))),3)","v":2.3210000000000002}]
[null,null,null,null,null,null,null,"T≥Ts"]
[]
[]
[null,null,null,null,"محاسبه ضريب زلزله در جهت X"]
[]
[]
[null,null,null,null,null,null,null,null,{"$f":"ROUND((L6*K22*L7/L11),4)","v":0.11609999999999999}]
[]
[]
[]
[]
[]
[]
[]
[]
[]
[]
[]
[]
[]
[]
[]
[]
[]
[]
[]
[]
[]
[]
[]
[]
[]
[]
[]
[null,null,null,null,null,null,null,null,null,null,null,null,"خطر زياد","خطر كم"]
[null,null,null,"ضريب اهميت","طبقه بندي ساختمان",null,null,"شتاب مبنا","توصيف",null,null,null,"S","S","TS","T0","نوع زمين"]
[null,null,null,1.4,"ساختمان با اهميت خيلي زياد",null,null,0.35,"پهنه با خطر نسبي خيلي زياد",null,null,null,1.5,1.5,0.4,0.1,"تيپ1"]
[null,null,null,1.2,"ساختمان با اهميت زياد",null,null,0.3,"پهنه با خطر نسبي زياد",null,null,null,1.5,1.5,0.5,0.1,"تيپ2"]
[null,null,null,1,"ساختمان با اهميت متوسط",null,null,0.25,"پهنه با خطر نسبي متوسط",null,null,null,1.75,1.75,0.7,0.15,"تيپ3"]
[null,null,null,0.8,"ساختمان با اهميت كم",null,null,0.2,"پهنه با خطر نسبي كم",null,null,null,1.75,2.25,1,0.15,"تيپ4"]
[]
[null,null,null,null,null,null,"ديوار باربر","قاب ساختماني ساده","قاب خمشي","تركيبي"]
[null,null,null,null,null,"ديوار باربر","ديوار برشي بتن آرمه ويژه","ديوار برشي بتن آرمه ويژه","قاب خمشي بتن آرمه ويژه","قاب خمشي ويژه(فولادي يا بتني)+ديوار برشي بتن آرمه ويژه",null,"قاب خمشي فولادي",null,null,{"$f":"ROUND(0.08*H14^(3/4),3)","v":0.89400000000000002}]
[null,null,null,null,null,"قاب ساختماني ساده","ديوار برشي بتن آرمه متوسط","ديوار برشي بتن آرمه متوسط","قاب خمشي بتن آرمه متوسط","قاب خمشي بتني متوسط+ديوار برشي بتن آرمه متوسط",null,"قاب خمشي بتن آرمه",null,null,{"$f":"ROUND(0.07*H14^(3/4),3)","v":0.78300000000000003}]
[null,null,null,null,null,"قاب خمشي","ديوار برشي بتن آرمه معمولي","ديوار برشي بتن آرمه معمولي","قاب خمشي بتن آرمه معمولي","قاب خمشي فولادي متوسط+ديوار برشي بتن آرمه متوسط",null,"قاب خمشي فولادي با جداگرهاي ميانقابي",null,null,{"$f":"ROUND(0.8*O65,3)","v":0.71499999999999997}]
[null,null,null,null,null,"تركيبي","ديوار برشي با مصالح بنايي مسلح","ديوار برشي با مصالح بنايي مسلح","قاب خمشي فولادي ويژه","قاب خمشي فولادي ويژه + مهاربند برون محور فولادي",null,"قاب خمشي بتني با جداگرهاي ميانقابي",null,null,{"$f":"ROUND(0.8*O66,3)","v":0.626}]
[null,null,null,null,null,null," ","مهاربندي برون محور فولادي","قاب خمشي فولادي متوسط","قاب خمشي فولادي ويژه + مهاربند هم محور فولادي",null,"ساير سيستم ها",null,null,{"$f":"ROUND(0.05*H14^(3/4),3)","v":0.55900000000000005}]
[null,null,null,null,null,null," ","مهاربندي هم محور فولادي","قاب خمشي فولادي معمولي","قاب خمشي فولادي متوسط + مهاربند برون محور فولادي"]
[null,null,null,null,null,null," "," "," ","قاب خمشي فولادي متوسط + مهاربند هم محور فولادي"]
[null,null,null,null,2]
[null,null,null,null,{"$f":"E72","v":2}]
[null,null,null,null,{"$f":"E73","v":2},null,null,2,null,null,{"$f":"IF(AND(I16>=0,I16<=I17),TRUE,FALSE)","v":false},{"$f":"1+(I19*(I16/I17))","v":9.3849999999999998}]
[null,null,null,null,2,null,null,null,null,null,{"$f":"IF(AND(I16>=I17,I16<=I18),TRUE,FALSE)","v":false},{"$f":"I19+1","v":2.5}]
[null,null,null,null,2,null,null,null,null,null,{"$f":"IF(I16>I18,TRUE,FALSE)","v":true},{"$f":"(I19+1)*(I18/I16)^(2/3)","v":2.3208414534798023}]
[null,null,null,null,2]
[null,null,null,null,2,null,{"$f":"IF(E72=1,G65,IF(E72=2,H65,IF(E72=3,I65,IF(E72=4,J65))))","v":"ديوار برشي بتن آرمه ويژه"}]
[null,null,null,null,2,null,{"$f":"IF(E73=1,G66,IF(E73=2,H66,IF(E73=3,I66,IF(E73=4,J66))))","v":"ديوار برشي بتن آرمه متوسط"}]
[null,null,null,null,2,null,"ديوار برشي بتن آرمه معمولي"]
[null,null,null,null,2,null,"ديوار برشي با مصالح بنايي مسلح"]
[null,null,null,null,2,null,"مهاربندي برون محور فولادي"]
[null,null,null,null,2,null,"مهاربندي هم محور فولادي"]
[null,null,null,null,2,null," "]

{"sheet":"ضريب زلزله Y","index":21,"n_rows":84,"n_cols":18,"rows_kept":84,"cut":false,"hidden":false,"merged":[[58,4,58,6],[58,8,58,10],[68,11,68,13],[59,4,59,6],[59,8,59,10],[60,4,60,6],[60,8,60,10],[61,4,61,6],[61,8,61,10],[62,8,62,10],[64,11,64,13],[65,11,65,13],[66,11,66,13],[67,11,67,13],[21,10,21,11],[25,4,26,11],[28,8,29,8],[57,4,57,6],[57,8,57,10],[22,4,22,5],[22,7,22,8],[16,4,16,5],[16,6,16,7],[16,8,16,9],[17,6,17,7],[17,8,17,9],[18,6,18,7],[18,8,18,9],[20,4,20,5],[20,7,20,8],[21,4,21,5],[21,7,21,8],[15,6,15,7],[15,8,15,9],[8,4,8,11],[9,4,9,5],[9,6,9,10],[10,4,10,5],[10,6,10,10],[12,4,12,11],[13,4,13,6],[13,9,13,11],[14,4,14,6],[14,7,14,8],[14,9,14,11],[7,4,7,11],[2,4,3,11],[5,4,5,5],[5,6,5,10],[6,4,6,5],[6,6,6,10]]}
[]
[]
[null,null,null,null,"محاسبه ضريب زلزله در جهت Y"]
[]
[]
[null,1,null,null,"شتاب مبنا",null,{"$f":"CHOOSE(B6,I59,I60,I61,I62)","v":"پهنه با خطر نسبي خيلي زياد"},null,null,null,null,{"$f":"CHOOSE(B6,H59,H60,H61,H62)","v":0.35}]
[null,3,null,null,"ضريب اهميت ساختمان",null,{"$f":"CHOOSE(B7,E59,E60,E61,E62)","v":"ساختمان با اهميت متوسط"},null,null,null,null,{"$f":"CHOOSE(B7,D59,D60,D61,D62)","v":1}]
[]
[null,null,null,null,"ضريب رفتار سازه"]
[null,null,null,null,"سيستم سازه",null,"سيستم مقاوم در برابر نيروهاي جانبي",null,null,null,null,"R"]
[null,{"$f":"E72","v":3},null,null,{"$f":"CHOOSE(B11,F65,F66,F67,F68)","v":"قاب خمشي"},null,{"$f":"CHOOSE(N11,G78,G79,G80,G81,G82,G83,G84)","v":"قاب خمشي بتن آرمه متوسط"},null,null,null,null,{"$f":"IF(AND(B11=1,N11=1),7,IF(AND(B11=1,N11=2),6,IF(AND(B11=1,N11=3),5,IF(AND(B11=1,N11=4),4,IF(AND(B11=2,N11=1),8,IF(AND(B11=2,N11=2),7,IF(AND(B11=2,N11=3),5,IF(AND(B11=2,N11=4),4,IF(AND(B11=2,N11=5),7,IF(AND(B11=2,N11=6),6,IF(AND(B11=3,N11=1),10,IF(AND(B11=3,N11=2),7,IF(AND(B11=3,N11=3),4,IF(AND(B11=3,N11=4),10,IF(AND(B11=3,N11=5),7,IF(AND(B11=3,N11=6),5,IF(AND(B11=4,N11=1),11,IF(AND(B11=4,N11=2),8,IF(AND(B11=4,N11=3),8,IF(AND(B11=4,N11=4),10,IF(AND(B11=4,N11=5),9,IF(AND(B11=4,N11=6),7,IF(AND(B11=4,N11=7),7)))))))))))))))))))))))","v":7},null,{"$f":"H74","v":2}]
[]
[null,null,null,null,"ضريب بازتاب سازه"]
[null,2,null,null,"ارتفاع ساختمان از تراز پايه",null,null,25,"نوع زمين",{"$f":"CHOOSE(B14,R59,R60,R61,R62)","v":"تيپ2"}]
[null,2,null,null,"زمان تناوب اصلي نوسان (T)",null,null,"نوع سيستم",null,{"$f":"CHOOSE(B15,L65,L66,L67,L68,L69)","v":"قاب خمشي بتن آرمه"}]
[null,null,null,null,null,null,"T=",null,{"$f":"CHOOSE(B15,P65,P66,P67,P68,P69)","v":0.78300000000000003}]
[null,null,null,null,null,null,"T0=",null,{"$f":"CHOOSE(B14,Q59,Q60,Q61,Q62)","v":0.1}]
[null,null,null,null,null,null,"Ts=",null,{"$f":"CHOOSE(B14,P59,P60,P61,P62)","v":0.5}]
[null,null,null,null,null,null,"S=",null,{"$f":"CHOOSE(B14,N59,N60,N61,IF(B6>2,2.25,IF(B6<=2,1.75)))","v":1.5}]
[]
[null,null,null,null,null,null,null,"0≤T≤T0"]
[null,null,null,null,"B=S+1",null,null,"T0≤T≤Ts",null,null,{"$f":"ROUND(IF(K74=TRUE,L74,IF(K75=TRUE,L75,IF(K76=TRUE,L76))),3)","v":1.8540000000000001}]
[null,null,null,null,null,null,null,"T≥Ts"]
[]
[]
[null,null,null,null,"محاسبه ضريب زلزله در جهت Y"]
[]
[]
[null,null,null,null,null,null,null,null,{"$f":"ROUND((L6*K22*L7/L11),4)","v":9.2700000000000005E-2}]
[]
[]
[]
[]
[]
[]
[]
[]
[]
[]
[]
[]
[]
[]
[]
[]
[]
[]
[]
[]
[]
[]
[]
[]
[]
[]
[]
[null,null,null,null,null,null,null,null,null,null,null,null,"خطر زياد","خطر كم"]
[null,null,null,"ضريب اهميت","طبقه بندي ساختمان",null,null,"شتاب مبنا","توصيف",null,null,null,"S","S",null,"TS","T0","نوع زمين"]
[null,null,null,1.4,"ساختمان با اهميت خيلي زياد",null,null,0.35,"پهنه با خطر نسبي خيلي زياد",null,null,null,1.5,1.5,null,0.4,0.1,"تيپ1"]
[null,null,null,1.2,"ساختمان با اهميت زياد",null,null,0.3,"پهنه با خطر نسبي زياد",null,null,null,1.5,1.5,null,0.5,0.1,"تيپ2"]
[null,null,null,1,"ساختمان با اهميت متوسط",null,null,0.25,"پهنه با خطر نسبي متوسط",null,null,null,1.75,1.75,null,0.7,0.15,"تيپ3"]
[null,null,null,0.8,"ساختمان با اهميت كم",null,null,0.2,"پهنه با خطر نسبي كم",null,null,null,1.75,2.25,null,1,0.15,"تيپ4"]
[]
[null,null,null,null,null,null,"ديوار باربر","قاب ساختماني ساده","قاب خمشي","تركيبي"]
[null,null,null,null,null,"ديوار باربر","ديوار برشي بتن آرمه ويژه","ديوار برشي بتن آرمه ويژه","قاب خمشي بتن آرمه ويژه","قاب خمشي ويژه(فولادي يا بتني)+ديوار برشي بتن آرمه ويژه",null,"قاب خمشي فولادي",null,null,null,{"$f":"ROUND(0.08*H14^(3/4),3)","v":0.89400000000000002}]
[null,null,null,null,null,"قاب ساختماني ساده","ديوار برشي بتن آرمه متوسط","ديوار برشي بتن آرمه متوسط","قاب خمشي بتن آرمه متوسط","قاب خمشي بتني متوسط+ديوار برشي بتن آرمه متوسط",null,"قاب خمشي بتن آرمه",null,null,null,{"$f":"ROUND(0.07*H14^(3/4),3)","v":0.78300000000000003}]
[null,null,null,null,null,"قاب خمشي","ديوار برشي بتن آرمه معمولي","ديوار برشي بتن آرمه معمولي","قاب خمشي بتن آرمه معمولي","قاب خمشي فولادي متوسط+ديوار برشي بتن آرمه متوسط",null,"قاب خمشي فولادي با جداگرهاي ميانقابي",null,null,null,{"$f":"ROUND(0.8*P65,3)","v":0.71499999999999997}]
[null,null,null,null,null,"تركيبي","ديوار برشي با مصالح بنايي مسلح","ديوار برشي با مصالح بنايي مسلح","قاب خمشي فولادي ويژه","قاب خمشي فولادي ويژه + مهاربند برون محور فولادي",null,"قاب خمشي بتني با جداگرهاي ميانقابي",null,null,null,{"$f":"ROUND(0.8*P66,3)","v":0.626}]
[null,null,null,null,null,null," ","مهاربندي برون محور فولادي","قاب خمشي فولادي متوسط","قاب خمشي فولادي ويژه + مهاربند هم محور فولادي",null,"ساير سيستم ها",null,null,null,{"$f":"ROUND(0.05*H14^(3/4),3)","v":0.55900000000000005}]
[null,null,null,null,null,null," ","مهاربندي هم محور فولادي","قاب خمشي فولادي معمولي","قاب خمشي فولادي متوسط + مهاربند برون محور فولادي"]
[null,null,null,null,null,null," "," "," ","قاب خمشي فولادي متوسط + مهاربند هم محور فولادي"]
[null,null,null,null,3]
[null,null,null,null,{"$f":"E72","v":3}]
[null,null,null,null,{"$f":"E73","v":3},null,null,2,null,null,{"$f":"IF(AND(I16>=0,I16<=I17),TRUE,FALSE)","v":false},{"$f":"1+(I19*(I16/I17))","v":12.745000000000001}]
[null,null,null,null,3,null,null,null,null,null,{"$f":"IF(AND(I16>=I17,I16<=I18),TRUE,FALSE)","v":false},{"$f":"I19+1","v":2.5}]
[null,null,null,null,3,null,null,null,null,null,{"$f":"IF(I16>I18,TRUE,FALSE)","v":true},{"$f":"(I19+1)*(I18/I16)^(2/3)","v":1.853868122906033}]
[null,null,null,null,3]
[null,null,null,null,3,null,{"$f":"IF(E72=1,G65,IF(E72=2,H65,IF(E72=3,I65,IF(E72=4,J65))))","v":"قاب خمشي بتن آرمه ويژه"}]
[null,null,null,null,3,null,{"$f":"IF(E73=1,G66,IF(E73=2,H66,IF(E73=3,I66,IF(E73=4,J66))))","v":"قاب خمشي بتن آرمه متوسط"}]
[null,null,null,null,3,null,"قاب خمشي بتن آرمه معمولي"]
[null,null,null,null,3,null,"قاب خمشي فولادي ويژه"]
[null,null,null,null,3,null,"قاب خمشي فولادي متوسط"]
[null,null,null,null,3,null,"قاب خمشي فولادي معمولي"]
[null,null,null,null,3,null," "]

{"sheet":"خلاصه","index":22,"n_rows":29,"n_cols":9,"rows_kept":29,"cut":false,"hidden":false,"merged":[[2,3,3,10],[6,3,6,4],[7,3,7,4],[6,7,6,10],[6,5,6,6],[7,7,7,10],[7,5,7,6],[5,3,5,10],[14,3,14,4],[14,5,14,6],[14,7,14,10],[10,3,10,4],[11,3,11,4],[10,5,10,6],[11,7,11,10],[11,5,11,6],[10,7,10,10],[12,3,12,4],[12,5,12,6],[12,7,12,10],[13,3,13,4],[13,5,13,6],[13,7,13,10],[28,8,28,10],[28,4,28,6],[15,3,15,4],[15,5,15,6],[15,7,15,10],[20,3,20,4],[20,7,20,10],[21,7,21,10],[25,3,25,10],[27,3,27,10],[21,3,21,4],[21,5,21,6],[20,5,20,6],[16,7,16,10],[16,5,16,6],[19,3,19,4],[8,3,8,4],[8,5,8,6],[8,7,8,10],[9,3,9,4],[9,5,9,6],[9,7,9,10],[19,5,19,6],[19,7,19,10],[24,3,24,10],[16,3,16,4],[17,3,17,4],[17,5,17,6],[17,7,17,10],[18,3,18,4],[18,5,18,6],[18,7,18,10]]}
[]
[]
[null,null,null,"خلاصه بارهاي وارد بر ساختمان"]
[]
[]
[null,null,null,"بارهاي ثقلي"]
[null,null,null,"بار زنده",null,"بار مرده",null,"اجزا سازه"]
[null,null,null,"----",null,{"$f":"'ديوار محيطي'!D34","v":775},null,"ديوار محيطي همسايه"]
[null,null,null,"----",null,{"$f":"'ديوار نما'!D38","v":655},null,"ديوار نما"]
[null,null,null,"----",null,{"$f":"'ديوار جان پناه'!D34","v":265},null,"ديوار جانپناه"]
[null,null,null,"----",null,{"$f":"'ديوار پله'!D34","v":780},null,"ديوارهاي پله\n"]
[null,null,null,350,null,{"$f":"'مورب پله'!E28","v":690},null,"قسمت مورب پله"]
[null,null,null,200,null,{"$f":"' كامپوزيت در طبقات'!D34","v":265},null,"كامپوزيت در طبقات\n"]
[null,null,null,150,null,{"$f":"' كامپوزيت در بام'!D34","v":215},null,"كامپوزيت در بام\n"]
[null,null,null,200,null,{"$f":"'تيرچه بلوك در طبقات '!D34","v":565},null,"تيرچه بلوك در طبقات\n"]
[null,null,null,150,null,{"$f":"'تيرچه بلوك در بام'!D34","v":515},null,"تيرچه بلوك دربام\n"]
[null,null,null,200,null,{"$f":"'کرمیت در طبقات'!D34","v":495},null,"کرمیت در طبقات"]
[null,null,null,150,null,{"$f":"'کرمیت در بام'!$D$34","v":450},null,"کرمیت در بام"]
[null,null,null,200,null,{"$f":"'کرمیت کامپوزیت در طبقات'!$D$34","v":440},null,"کرمیت کامپوزیت در طبقات"]
[null,null,null,150,null,{"$f":"'کرمیت کامپوزیت در بام'!D34","v":390},null,"کرمیت کامپوزیت در بام"]
[null,null,null,200,null,{"$f":"'دال در طبقات'!D34","v":265},null,"دال در طبقات\n"]
[null,null,null,150,null,{"$f":"'دال در بام'!D34","v":215},null,"دال در بام\n"]
[]
[]
[null,null,null,"بار برف"]
[null,null,null,{"$f":"'بار برف'!G45","v":50}]
[]
[null,null,null,"بار زلزله"]
[null,null,null,{"$f":"'ضريب زلزله Y'!I29","v":9.2700000000000005E-2},"ضريب زلزله در جهت Y=",null,null,{"$f":"'ضريب زلزله X'!I29","v":0.11609999999999999},"ضريب زلزله در جهت X="]

{"sheet":"وزن سازه بتنی","index":23,"n_rows":135,"n_cols":36,"rows_kept":135,"cut":false,"hidden":false,"merged":[[31,4,32,10],[31,11,31,17],[31,18,31,24],[31,25,31,31],[32,11,32,17],[32,18,32,24],[32,25,32,31],[28,4,29,10],[28,11,28,17],[28,18,28,24],[28,25,28,31],[29,11,29,17],[29,18,29,24],[29,25,29,31],[26,4,27,10],[26,11,26,17],[26,18,26,24],[26,25,26,31],[27,11,27,17],[27,18,27,24],[27,25,27,31],[24,4,25,10],[24,11,24,17],[24,18,24,24],[24,25,24,31],[25,11,25,17],[25,18,25,24],[25,25,25,31],[22,4,23,10],[22,11,22,17],[22,18,22,24],[22,25,22,31],[23,11,23,17],[23,18,23,24],[23,25,23,31],[20,4,21,10],[20,11,20,17],[20,18,20,24],[20,25,20,31],[21,11,21,17],[21,18,21,24],[21,25,21,31],[18,4,19,10],[18,11,18,17],[18,18,18,24],[18,25,18,31],[19,11,19,17],[19,18,19,24],[19,25,19,31],[16,4,17,10],[16,11,16,17],[16,18,16,24],[16,25,16,31],[17,11,17,17],[17,18,17,24],[17,25,17,31],[14,4,15,10],[14,11,14,17],[14,18,14,24],[14,25,14,31],[15,11,15,17],[15,18,15,24],[15,25,15,31],[12,18,12,24],[12,25,12,31],[13,11,13,17],[13,18,13,24],[13,25,13,31],[12,4,13,10],[12,11,12,17],[9,4,9,31],[10,11,10,17],[10,18,10,24],[10,25,10,31],[11,11,11,17],[11,18,11,24],[11,25,11,31],[10,4,11,10],[5,8,5,15],[5,16,5,23],[5,24,5,31],[6,8,6,15],[6,16,6,23],[6,24,6,31],[6,0,7,1],[8,0,8,1],[1,4,2,14],[1,15,2,31],[3,8,3,15],[3,16,3,23],[3,24,3,31],[4,8,4,15],[4,16,4,23],[4,24,4,31],[3,4,8,7],[7,8,7,15],[7,16,7,23],[7,24,7,31],[8,8,8,15],[8,16,8,23],[8,24,8,31],[35,4,36,14],[35,15,36,31],[37,4,42,7],[37,8,37,15],[37,16,37,23],[37,24,37,31],[38,8,38,15],[38,16,38,23],[38,24,38,31],[39,8,39,15],[39,16,39,23],[39,24,39,31],[40,8,40,15],[40,16,40,23],[40,24,40,31],[41,8,41,15],[41,16,41,23],[41,24,41,31],[42,8,42,15],[42,16,42,23],[42,24,42,31],[43,4,43,31],[44,4,45,10],[44,11,44,17],[44,18,44,24],[44,25,44,31],[45,11,45,17],[45,18,45,24],[45,25,45,31],[46,4,47,10],[46,11,46,17],[46,18,46,24],[46,25,46,31],[47,11,47,17],[47,18,47,24],[47,25,47,31],[48,4,49,10],[48,11,48,17],[48,18,48,24],[48,25,48,31],[49,11,49,17],[49,18,49,24],[49,25,49,31],[50,4,51,10],[50,11,50,17],[50,18,50,24],[50,25,50,31],[51,11,51,17],[51,18,51,24],[51,25,51,31],[52,4,53,10],[52,11,52,17],[52,18,52,24],[52,25,52,31],[53,11,53,17],[53,18,53,24],[53,25,53,31],[54,4,55,10],[54,11,54,17],[54,18,54,24],[54,25,54,31],[55,11,55,17],[55,18,55,24],[55,25,55,31],[56,4,57,10],[56,11,56,17],[56,18,56,24],[56,25,56,31],[57,11,57,17],[57,18,57,24],[57,25,57,31],[58,4,59,10],[58,11,58,17],[58,18,58,24],[58,25,58,31],[59,11,59,17],[59,18,59,24],[59,25,59,31],[60,4,61,10],[60,11,60,17],[60,18,60,24],[60,25,60,31],[61,11,61,17],[61,18,61,24],[61,25,61,31],[62,4,63,10],[62,11,62,17],[62,18,62,24],[62,25,62,31],[63,11,63,17],[63,18,63,24],[63,25,63,31],[65,4,66,10],[65,11,65,17],[65,18,65,24],[65,25,65,31],[66,11,66,17],[66,18,66,24],[66,25,66,31],[69,4,70,14],[69,15,70,31],[71,4,76,7],[71,8,71,15],[71,16,71,23],[71,24,71,31],[72,8,72,15],[72,16,72,23],[72,24,72,31],[73,8,73,15],[73,16,73,23],[73,24,73,31],[74,8,74,15],[74,16,74,23],[74,24,74,31],[75,8,75,15],[75,16,75,23],[75,24,75,31],[76,8,76,15],[76,16,76,23],[76,24,76,31],[77,4,77,31],[78,4,79,10],[78,11,78,17],[78,18,78,24],[78,25,78,31],[79,11,79,17],[79,18,79,24],[79,25,79,31],[80,4,81,10],[80,11,80,17],[80,18,80,24],[80,25,80,31],[81,11,81,17],[81,18,81,24],[81,25,81,31],[82,4,83,10],[82,11,82,17],[82,18,82,24],[82,25,82,31],[83,11,83,17],[83,18,83,24],[83,25,83,31],[84,4,85,10],[84,11,84,17],[84,18,84,24],[84,25,84,31],[85,11,85,17],[85,18,85,24],[85,25,85,31],[86,4,87,10],[86,11,86,17],[86,18,86,24],[86,25,86,31],[87,11,87,17],[87,18,87,24],[87,25,87,31],[88,4,89,10],[88,11,88,17],[88,18,88,24],[88,25,88,31],[89,11,89,17],[89,18,89,24],[89,25,89,31],[90,4,91,10],[90,11,90,17],[90,18,90,24],[90,25,90,31],[91,11,91,17],[91,18,91,24],[91,25,91,31],[92,4,93,10],[92,11,92,17],[92,18,92,24],[92,25,92,31],[93,11,93,17],[93,18,93,24],[93,25,93,31],[94,4,95,10],[94,11,94,17],[94,18,94,24],[94,25,94,31],[95,11,95,17],[95,18,95,24],[95,25,95,31],[96,4,97,10],[96,11,96,17],[96,18,96,24],[96,25,96,31],[97,11,97,17],[97,18,97,24],[97,25,97,31],[99,4,100,10],[99,11,99,17],[99,18,99,24],[99,25,99,31],[100,11,100,17],[100,18,100,24],[100,25,100,31],[103,4,104,14],[103,15,104,31],[105,4,110,7],[105,8,105,15],[105,16,105,23],[105,24,105,31],[106,8,106,15],[106,16,106,23],[106,24,106,31],[107,8,107,15],[107,16,107,23],[107,24,107,31],[108,8,108,15],[108,16,108,23],[108,24,108,31],[109,8,109,15],[109,16,109,23],[109,24,109,31],[110,8,110,15],[110,16,110,23],[110,24,110,31],[111,4,111,31],[112,4,113,10],[112,11,112,17],[112,18,112,24],[112,25,112,31],[113,11,113,17],[113,18,113,24],[113,25,113,31],[114,4,115,10],[114,11,114,17],[114,18,114,24],[114,25,114,31],[115,11,115,17],[115,18,115,24],[115,25,115,31],[116,4,117,10],[116,11,116,17],[116,18,116,24],[116,25,116,31],[117,11,117,17],[117,18,117,24],[117,25,117,31],[118,4,119,10],[118,11,118,17],[118,18,118,24],[118,25,118,31],[119,11,119,17],[119,18,119,24],[119,25,119,31],[120,4,121,10],[120,11,120,17],[120,18,120,24],[120,25,120,31],[121,11,121,17],[121,18,121,24],[121,25,121,31],[122,4,123,10],[122,11,122,17],[122,18,122,24],[122,25,122,31],[123,11,123,17],[123,18,123,24],[123,25,123,31],[124,4,125,10],[124,11,124,17],[124,18,124,24],[124,25,124,31],[125,11,125,17],[125,18,125,24],[125,25,125,31],[126,4,127,10],[126,11,126,17],[126,18,126,24],[126,25,126,31],[127,11,127,17],[127,18,127,24],[127,25,127,31],[133,4,134,10],[133,11,133,17],[133,18,133,24],[133,25,133,31],[134,11,134,17],[134,18,134,24],[134,25,134,31],[128,4,129,10],[128,11,128,17],[128,18,128,24],[128,25,128,31],[129,11,129,17],[129,18,129,24],[129,25,129,31],[130,4,131,10],[130,11,130,17],[130,18,130,24],[130,25,130,31],[131,11,131,17],[131,18,131,24],[131,25,131,31]]}
[]
[null,null,null,null,"تیپ 1:پارکینگ",null,null,null,null,null,null,null,null,null,null,"محاسبه وزن ساختمان در طبقه"]
[]
[null,null,null,null,"مشخصات سازه",null,null,null,"مساحت سازه (m2)",null,null,null,null,null,null,null,"مساحت ایستگاه پله (m2)",null,null,null,null,null,null,null,"ارتفاع طبقه (m)"]
[null,null,null,null,null,null,null,null,145,null,null,null,null,null,null,null,15,null,null,null,null,null,null,null,2.8]
[null,null,null,null,null,null,null,null,"ارتفاع مفید طبقه (m)",null,null,null,null,null,null,null,"طول ستون (cm)",null,null,null,null,null,null,null,"عرض ستون (cm)"]
["وزن مخصوص بتن (ton/m3)",null,null,null,null,null,null,null,2.5,null,null,null,null,null,null,null,40,null,null,null,null,null,null,null,40]
[null,null,null,null,null,null,null,null,"عرض تیر (cm)",null,null,null,null,null,null,null,"ارتفاع تیر (cm)",null,null,null,null,null,null,null,"ضخامت دیوار برشی(cm)"]
[2.5,null,null,null,null,null,null,null,30,null,null,null,null,null,null,null,40,null,null,null,null,null,null,null,30]
[null,null,null,null,"وزن اجزا مختلف سازه"]
[null,null,null,null,"دیوار نما",null,null,null,null,null,null,"طول کل",null,null,null,null,null,null,"وزن",null,null,null,null,null,null,"وزن کل ( ton )"]
[null,null,null,null,null,null,null,null,null,null,null,14.25,null,null,null,null,null,null,{"$f":"خلاصه!$F$9","v":655},null,null,null,null,null,null,{"$f":"L12*S12*0.001","v":9.3337500000000002}]
[null,null,null,null,"دیوار مجاور همسایه",null,null,null,null,null,null,"طول کل",null,null,null,null,null,null,"وزن",null,null,null,null,null,null,"وزن کل"]
[null,null,null,null,null,null,null,null,null,null,null,18,null,null,null,null,null,null,{"$f":"خلاصه!$F$8","v":775},null,null,null,null,null,null,{"$f":"L14*S14*0.001","v":13.950000000000001}]
[null,null,null,null,"دیوار جان پناه",null,null,null,null,null,null,"طول کل",null,null,null,null,null,null,"وزن",null,null,null,null,null,null,"وزن کل"]
[null,null,null,null,null,null,null,null,null,null,null,0,null,null,null,null,null,null,{"$f":"خلاصه!$F$10","v":265},null,null,null,null,null,null,{"$f":"L16*S16*0.001","v":0}]
[null,null,null,null,"دیوار برشی",null,null,null,null,null,null,"طول کل",null,null,null,null,null,null,"حجم ",null,null,null,null,null,null,"وزن کل"]
[null,null,null,null,null,null,null,null,null,null,null,12,null,null,null,null,null,null,{"$f":"L18*Y9*I7*0.01","v":9},null,null,null,null,null,null,{"$f":"S18*A9","v":22.5}]
[null,null,null,null,"تیرها",null,null,null,null,null,null,"طول کل",null,null,null,null,null,null,"حجم ",null,null,null,null,null,null,"وزن کل"]
[null,null,null,null,null,null,null,null,null,null,null,74,null,null,null,null,null,null,{"$f":"L20*I9*Q9*0.0001","v":8.8800000000000008},null,null,null,null,null,null,{"$f":"S20*$A$9","v":22.200000000000003}]
[null,null,null,null,"ستون ها",null,null,null,null,null,null,"تعداد",null,null,null,null,null,null,"حجم ",null,null,null,null,null,null,"وزن کل"]
[null,null,null,null,null,null,null,null,null,null,null,14,null,null,null,null,null,null,{"$f":"L22*I7*Q7*Y7*0.0001","v":5.6000000000000005},null,null,null,null,null,null,{"$f":"S22*A9","v":14.000000000000002}]
[null,null,null,null,"بار مرده سقف",null,null,null,null,null,null,"مساحت کل",null,null,null,null,null,null,"وزن",null,null,null,null,null,null,"وزن کل",null,null,null,null,null,null,null,null,null,3]
[null,null,null,null,null,null,null,null,null,null,null,{"$f":"I5","v":145},null,null,null,null,null,null,{"$f":"CHOOSE(AJ23,خلاصه!$F$13,خلاصه!$F$14,خلاصه!$F$15,خلاصه!$F$16,خلاصه!$F$17,خلاصه!$F$18,خلاصه!$F$19,خلاصه!$F$20,خلاصه!$F$21,خلاصه!$F$22)","v":565},null,null,null,null,null,null,{"$f":"L24*S24*0.001","v":81.924999999999997}]
[null,null,null,null,"بار زنده سقف",null,null,null,null,null,null,"مساحت کل",null,null,null,null,null,null,"وزن",null,null,null,null,null,null,"وزن کل",null,null,null,null,null,null,null,null,null,3]
[null,null,null,null,null,null,null,null,null,null,null,{"$f":"I5","v":145},null,null,null,null,null,null,{"$f":"CHOOSE(AJ25,خلاصه!$D$13,خلاصه!$D$14,خلاصه!$D$15,خلاصه!$D$16,خلاصه!$D$17,خلاصه!$D$18,خلاصه!$D$19,خلاصه!$D$20,خلاصه!$D$21,خلاصه!$D$22)","v":200},null,null,null,null,null,null,{"$f":"I5*S26*0.001","v":29}]
[null,null,null,null,"بار مرده راه پله",null,null,null,null,null,null,"مساحت کل",null,null,null,null,null,null,"وزن",null,null,null,null,null,null,"وزن کل"]
[null,null,null,null,null,null,null,null,null,null,null,{"$f":"Q5","v":15},null,null,null,null,null,null,{"$f":"خلاصه!$F$12","v":690},null,null,null,null,null,null,{"$f":"L28*S28*0.001","v":10.35}]
[null,null,null,null,"بار زنده راه پله",null,null,null,null,null,null,"مساحت کل",null,null,null,null,null,null,"وزن",null,null,null,null,null,null,"وزن کل"]
[null,null,null,null,null,null,null,null,null,null,null,{"$f":"Q5","v":15},null,null,null,null,null,null,{"$f":"خلاصه!$D$12","v":350},null,null,null,null,null,null,{"$f":"L30*S30*0.001","v":5.25}]
[]
[null,null,null,null,"وزن کل",null,null,null,null,null,null,"کل بار مرده ",null,null,null,null,null,null,"کل بار زنده",null,null,null,null,null,null,"کل بار مرده وزنده"]
[null,null,null,null,null,null,null,null,null,null,null,{"$f":"Z12+Z14+Z16+Z18+Z20+Z22+Z24+Z28","v":174.25874999999999},null,null,null,null,null,null,{"$f":"Z30+Z26","v":34.25},null,null,null,null,null,null,{"$f":"L33+S33","v":208.50874999999999}]
[]
[]
[null,null,null,null,"تیپ 2:مسکونی",null,null,null,null,null,null,null,null,null,null,"محاسبه وزن ساختمان در طبقه"]
[]
[null,null,null,null,"مشخصات سازه",null,null,null,"مساحت سازه (m2)",null,null,null,null,null,null,null,"مساحت ایستگاه پله (m2)",null,null,null,null,null,null,null,"ارتفاع طبقه (m)"]
[null,null,null,null,null,null,null,null,145,null,null,null,null,null,null,null,15,null,null,null,null,null,null,null,3.5]
[null,null,null,null,null,null,null,null,"ارتفاع مفید طبقه (m)",null,null,null,null,null,null,null,"طول ستون (cm)",null,null,null,null,null,null,null,"عرض ستون (cm)"]
[null,null,null,null,null,null,null,null,3.1,null,null,null,null,null,null,null,40,null,null,null,null,null,null,null,40]
[null,null,null,null,null,null,null,null,"عرض تیر (cm)",null,null,null,null,null,null,null,"ارتفاع تیر (cm)",null,null,null,null,null,null,null,"ضخامت دیوار برشی(cm)"]
[null,null,null,null,null,null,null,null,30,null,null,null,null,null,null,null,40,null,null,null,null,null,null,null,30]
[null,null,null,null,"وزن اجزا مختلف سازه"]
[null,null,null,null,"دیوار نما",null,null,null,null,null,null,"طول کل",null,null,null,null,null,null,"وزن",null,null,null,null,null,null,"وزن کل ( ton )"]
[null,null,null,null,null,null,null,null,null,null,null,14.25,null,null,null,null,null,null,{"$f":"خلاصه!$F$9","v":655},null,null,null,null,null,null,{"$f":"L46*S46*0.001","v":9.3337500000000002}]
[null,null,null,null,"دیوار مجاور همسایه",null,null,null,null,null,null,"طول کل",null,null,null,null,null,null,"وزن",null,null,null,null,null,null,"وزن کل"]
[null,null,null,null,null,null,null,null,null,null,null,18,null,null,null,null,null,null,{"$f":"خلاصه!$F$8","v":775},null,null,null,null,null,null,{"$f":"L48*S48*0.001","v":13.950000000000001}]
[null,null,null,null,"دیوار جان پناه",null,null,null,null,null,null,"طول کل",null,null,null,null,null,null,"وزن",null,null,null,null,null,null,"وزن کل"]
[null,null,null,null,null,null,null,null,null,null,null,0,null,null,null,null,null,null,{"$f":"خلاصه!$F$10","v":265},null,null,null,null,null,null,{"$f":"L50*S50*0.001","v":0}]
[null,null,null,null,"دیوار برشی",null,null,null,null,null,null,"طول کل",null,null,null,null,null,null,"حجم ",null,null,null,null,null,null,"وزن کل"]
[null,null,null,null,null,null,null,null,null,null,null,12,null,null,null,null,null,null,{"$f":"L52*Y43*I41*0.01","v":11.16},null,null,null,null,null,null,{"$f":"S52*A9","v":27.9}]
[null,null,null,null,"تیرها",null,null,null,null,null,null,"طول کل",null,null,null,null,null,null,"حجم ",null,null,null,null,null,null,"وزن کل"]
[null,null,null,null,null,null,null,null,null,null,null,74,null,null,null,null,null,null,{"$f":"L54*I43*Q43*0.0001","v":8.8800000000000008},null,null,null,null,null,null,{"$f":"S54*$A$9","v":22.200000000000003}]
[null,null,null,null,"ستون ها",null,null,null,null,null,null,"تعداد",null,null,null,null,null,null,"حجم ",null,null,null,null,null,null,"وزن کل"]
[null,null,null,null,null,null,null,null,null,null,null,14,null,null,null,null,null,null,{"$f":"L56*I41*Q41*Y41*0.0001","v":6.944},null,null,null,null,null,null,{"$f":"S56*A9","v":17.36}]
[null,null,null,null,"بار مرده سقف",null,null,null,null,null,null,"مساحت کل",null,null,null,null,null,null,"وزن",null,null,null,null,null,null,"وزن کل",null,null,null,null,null,null,null,null,null,3]
[null,null,null,null,null,null,null,null,null,null,null,{"$f":"I39","v":145},null,null,null,null,null,null,{"$f":"CHOOSE(AJ57,خلاصه!$F$13,خلاصه!$F$14,خلاصه!$F$15,خلاصه!$F$16,خلاصه!$F$17,خلاصه!$F$18,خلاصه!$F$19,خلاصه!$F$20,خلاصه!$F$21,خلاصه!$F$22)","v":565},null,null,null,null,null,null,{"$f":"L58*S58*0.001","v":81.924999999999997}]
[null,null,null,null,"بار زنده سقف",null,null,null,null,null,null,"مساحت کل",null,null,null,null,null,null,"وزن",null,null,null,null,null,null,"وزن کل",null,null,null,null,null,null,null,null,null,3]
[null,null,null,null,null,null,null,null,null,null,null,{"$f":"I39","v":145},null,null,null,null,null,null,{"$f":"CHOOSE(AJ59,خلاصه!$D$13,خلاصه!$D$14,خلاصه!$D$15,خلاصه!$D$16,خلاصه!$D$17,خلاصه!$D$18,خلاصه!$D$19,خلاصه!$D$20,خلاصه!$D$21,خلاصه!$D$22)","v":200},null,null,null,null,null,null,{"$f":"I39*S60*0.001","v":29}]
[null,null,null,null,"بار مرده راه پله",null,null,null,null,null,null,"مساحت کل",null,null,null,null,null,null,"وزن",null,null,null,null,null,null,"وزن کل"]
[null,null,null,null,null,null,null,null,null,null,null,{"$f":"Q39","v":15},null,null,null,null,null,null,{"$f":"خلاصه!$F$12","v":690},null,null,null,null,null,null,{"$f":"L62*S62*0.001","v":10.35}]
[null,null,null,null,"بار زنده راه پله",null,null,null,null,null,null,"مساحت کل",null,null,null,null,null,null,"وزن",null,null,null,null,null,null,"وزن کل"]
[null,null,null,null,null,null,null,null,null,null,null,{"$f":"Q39","v":15},null,null,null,null,null,null,{"$f":"خلاصه!$D$12","v":350},null,null,null,null,null,null,{"$f":"L64*S64*0.001","v":5.25}]
[]
[null,null,null,null,"وزن کل",null,null,null,null,null,null,"کل بار مرده ",null,null,null,null,null,null,"کل بار زنده",null,null,null,null,null,null,"کل بار مرده وزنده"]
[null,null,null,null,null,null,null,null,null,null,null,{"$f":"Z46+Z48+Z50+Z52+Z54+Z56+Z58+Z62","v":183.01874999999998},null,null,null,null,null,null,{"$f":"Z64+Z60","v":34.25},null,null,null,null,null,null,{"$f":"L67+S67","v":217.26874999999998}]
[]
[]
[null,null,null,null,"تیپ 3:بام",null,null,null,null,null,null,null,null,null,null,"محاسبه وزن ساختمان در طبقه"]
[]
[null,null,null,null,"مشخصات سازه",null,null,null,"مساحت سازه (m2)",null,null,null,null,null,null,null,"مساحت ایستگاه پله (m2)",null,null,null,null,null,null,null,"ارتفاع طبقه (m)"]
[null,null,null,null,null,null,null,null,145,null,null,null,null,null,null,null,15,null,null,null,null,null,null,null,3.2]
[null,null,null,null,null,null,null,null,"ارتفاع مفید طبقه (m)",null,null,null,null,null,null,null,"طول ستون (cm)",null,null,null,null,null,null,null,"عرض ستون (cm)"]
[null,null,null,null,null,null,null,null,2.9,null,null,null,null,null,null,null,40,null,null,null,null,null,null,null,40]
[null,null,null,null,null,null,null,null,"عرض تیر (cm)",null,null,null,null,null,null,null,"ارتفاع تیر (cm)",null,null,null,null,null,null,null,"ضخامت دیوار برشی(cm)"]
[null,null,null,null,null,null,null,null,30,null,null,null,null,null,null,null,40,null,null,null,null,null,null,null,30]
[null,null,null,null,"وزن اجزا مختلف سازه"]
[null,null,null,null,"دیوار نما",null,null,null,null,null,null,"طول کل",null,null,null,null,null,null,"وزن",null,null,null,null,null,null,"وزن کل ( ton )"]
[null,null,null,null,null,null,null,null,null,null,null,14.25,null,null,null,null,null,null,{"$f":"خلاصه!$F$9","v":655},null,null,null,null,null,null,{"$f":"L80*S80*0.001","v":9.3337500000000002}]
[null,null,null,null,"دیوار مجاور همسایه",null,null,null,null,null,null,"طول کل",null,null,null,null,null,null,"وزن",null,null,null,null,null,null,"وزن کل"]
[null,null,null,null,null,null,null,null,null,null,null,18,null,null,null,null,null,null,{"$f":"خلاصه!$F$8","v":775},null,null,null,null,null,null,{"$f":"L82*S82*0.001","v":13.950000000000001}]
[null,null,null,null,"دیوار جان پناه",null,null,null,null,null,null,"طول کل",null,null,null,null,null,null,"وزن",null,null,null,null,null,null,"وزن کل"]
[null,null,null,null,null,null,null,null,null,null,null,45,null,null,null,null,null,null,{"$f":"خلاصه!$F$10","v":265},null,null,null,null,null,null,{"$f":"L84*S84*0.001","v":11.925000000000001}]
[null,null,null,null,"دیوار برشی",null,null,null,null,null,null,"طول کل",null,null,null,null,null,null,"حجم ",null,null,null,null,null,null,"وزن کل"]
[null,null,null,null,null,null,null,null,null,null,null,12,null,null,null,null,null,null,{"$f":"L86*Y77*I75*0.01","v":10.44},null,null,null,null,null,null,{"$f":"S86*A9","v":26.099999999999998}]
[null,null,null,null,"تیرها",null,null,null,null,null,null,"طول کل",null,null,null,null,null,null,"حجم ",null,null,null,null,null,null,"وزن کل"]
[null,null,null,null,null,null,null,null,null,null,null,74,null,null,null,null,null,null,{"$f":"L88*I77*Q77*0.0001","v":8.8800000000000008},null,null,null,null,null,null,{"$f":"S88*$A$9","v":22.200000000000003}]
[null,null,null,null,"ستون ها",null,null,null,null,null,null,"تعداد",null,null,null,null,null,null,"حجم ",null,null,null,null,null,null,"وزن کل"]
[null,null,null,null,null,null,null,null,null,null,null,14,null,null,null,null,null,null,{"$f":"L90*I75*Q75*Y75*0.0001","v":6.4960000000000004},null,null,null,null,null,null,{"$f":"S90*A9","v":16.240000000000002}]
[null,null,null,null,"بار مرده سقف",null,null,null,null,null,null,"مساحت کل",null,null,null,null,null,null,"وزن",null,null,null,null,null,null,"وزن کل",null,null,null,null,null,null,null,null,null,4]
[null,null,null,null,null,null,null,null,null,null,null,{"$f":"I73","v":145},null,null,null,null,null,null,{"$f":"CHOOSE(AJ91,خلاصه!$F$13,خلاصه!$F$14,خلاصه!$F$15,خلاصه!$F$16,خلاصه!$F$17,خلاصه!$F$18,خلاصه!$F$19,خلاصه!$F$20,خلاصه!$F$21,خلاصه!$F$22)","v":515},null,null,null,null,null,null,{"$f":"L92*S92*0.001","v":74.674999999999997}]
[null,null,null,null,"بار زنده سقف",null,null,null,null,null,null,"مساحت کل",null,null,null,null,null,null,"وزن",null,null,null,null,null,null,"وزن کل",null,null,null,null,null,null,null,null,null,4]
[null,null,null,null,null,null,null,null,null,null,null,{"$f":"I73","v":145},null,null,null,null,null,null,{"$f":"CHOOSE(AJ93,خلاصه!$D$13,خلاصه!$D$14,خلاصه!$D$15,خلاصه!$D$16,خلاصه!$D$17,خلاصه!$D$18,خلاصه!$D$19,خلاصه!$D$20,خلاصه!$D$21,خلاصه!$D$22)","v":150},null,null,null,null,null,null,{"$f":"I73*S94*0.001","v":21.75}]
[null,null,null,null,"بار مرده راه پله",null,null,null,null,null,null,"مساحت کل",null,null,null,null,null,null,"وزن",null,null,null,null,null,null,"وزن کل"]
[null,null,null,null,null,null,null,null,null,null,null,{"$f":"Q73","v":15},null,null,null,null,null,null,{"$f":"خلاصه!$F$12","v":690},null,null,null,null,null,null,{"$f":"L96*S96*0.001","v":10.35}]
[null,null,null,null,"بار زنده راه پله",null,null,null,null,null,null,"مساحت کل",null,null,null,null,null,null,"وزن",null,null,null,null,null,null,"وزن کل"]
[null,null,null,null,null,null,null,null,null,null,null,{"$f":"Q73","v":15},null,null,null,null,null,null,{"$f":"خلاصه!$D$12","v":350},null,null,null,null,null,null,{"$f":"L98*S98*0.001","v":5.25}]
[]
[null,null,null,null,"وزن کل",null,null,null,null,null,null,"کل بار مرده ",null,null,null,null,null,null,"کل بار زنده",null,null,null,null,null,null,"کل بار مرده وزنده"]
[null,null,null,null,null,null,null,null,null,null,null,{"$f":"Z80+Z82+Z84+Z86+Z88+Z90+Z92+Z96","v":184.77374999999998},null,null,null,null,null,null,{"$f":"Z98+Z94","v":27},null,null,null,null,null,null,{"$f":"L101+S101","v":211.77374999999998}]
[]
[]
[null,null,null,null,"تیپ 4:خرپشته",null,null,null,null,null,null,null,null,null,null,"محاسبه وزن ساختمان در طبقه"]
[]
[null,null,null,null,"مشخصات سازه",null,null,null,"مساحت سازه (m2)",null,null,null,null,null,null,null,"مساحت ایستگاه پله (m2)",null,null,null,null,null,null,null,"ارتفاع طبقه (m)"]
[null,null,null,null,null,null,null,null,15,null,null,null,null,null,null,null,0,null,null,null,null,null,null,null,2.9]
[null,null,null,null,null,null,null,null,"ارتفاع مفید طبقه (m)",null,null,null,null,null,null,null,"طول ستون (cm)",null,null,null,null,null,null,null,"عرض ستون (cm)"]
[null,null,null,null,null,null,null,null,2.5,null,null,null,null,null,null,null,40,null,null,null,null,null,null,null,40]
[null,null,null,null,null,null,null,null,"عرض تیر (cm)",null,null,null,null,null,null,null,"ارتفاع تیر (cm)",null,null,null,null,null,null,null,"ضخامت دیوار برشی(cm)"]
[null,null,null,null,null,null,null,null,30,null,null,null,null,null,null,null,40,null,null,null,null,null,null,null,0]
[null,null,null,null,"وزن اجزا مختلف سازه"]
[null,null,null,null,"دیوار نما",null,null,null,null,null,null,"طول کل",null,null,null,null,null,null,"وزن",null,null,null,null,null,null,"وزن کل ( ton )"]
[null,null,null,null,null,null,null,null,null,null,null,0,null,null,null,null,null,null,{"$f":"خلاصه!$F$9","v":655},null,null,null,null,null,null,{"$f":"L114*S114*0.001","v":0}]
[null,null,null,null,"دیوار مجاور همسایه",null,null,null,null,null,null,"طول کل",null,null,null,null,null,null,"وزن",null,null,null,null,null,null,"وزن کل"]
[null,null,null,null,null,null,null,null,null,null,null,16,null,null,null,null,null,null,{"$f":"خلاصه!$F$8","v":775},null,null,null,null,null,null,{"$f":"L116*S116*0.001","v":12.4}]
[null,null,null,null,"دیوار جان پناه",null,null,null,null,null,null,"طول کل",null,null,null,null,null,null,"وزن",null,null,null,null,null,null,"وزن کل"]
[null,null,null,null,null,null,null,null,null,null,null,0,null,null,null,null,null,null,{"$f":"خلاصه!$F$10","v":265},null,null,null,null,null,null,{"$f":"L118*S118*0.001","v":0}]
[null,null,null,null,"دیوار برشی",null,null,null,null,null,null,"طول کل",null,null,null,null,null,null,"حجم ",null,null,null,null,null,null,"وزن کل"]
[null,null,null,null,null,null,null,null,null,null,null,0,null,null,null,null,null,null,{"$f":"L120*Y111*I109*0.01","v":0},null,null,null,null,null,null,{"$f":"S120*A9","v":0}]
[null,null,null,null,"تیرها",null,null,null,null,null,null,"طول کل",null,null,null,null,null,null,"حجم ",null,null,null,null,null,null,"وزن کل"]
[null,null,null,null,null,null,null,null,null,null,null,16,null,null,null,null,null,null,{"$f":"L122*I111*Q111*0.0001","v":1.9200000000000002},null,null,null,null,null,null,{"$f":"S122*$A$9","v":4.8000000000000007}]
[null,null,null,null,"ستون ها",null,null,null,null,null,null,"تعداد",null,null,null,null,null,null,"حجم ",null,null,null,null,null,null,"وزن کل"]
[null,null,null,null,null,null,null,null,null,null,null,4,null,null,null,null,null,null,{"$f":"L124*I109*Q109*Y109*0.0001","v":1.6},null,null,null,null,null,null,{"$f":"S124*A9","v":4}]
[null,null,null,null,"بار مرده سقف",null,null,null,null,null,null,"مساحت کل",null,null,null,null,null,null,"وزن",null,null,null,null,null,null,"وزن کل",null,null,null,null,null,null,null,null,null,4]
[null,null,null,null,null,null,null,null,null,null,null,{"$f":"I107","v":15},null,null,null,null,null,null,{"$f":"CHOOSE(AJ125,خلاصه!$F$13,خلاصه!$F$14,خلاصه!$F$15,خلاصه!$F$16,خلاصه!$F$17,خلاصه!$F$18,خلاصه!$F$19,خلاصه!$F$20,خلاصه!$F$21,خلاصه!$F$22)","v":515},null,null,null,null,null,null,{"$f":"L126*S126*0.001","v":7.7250000000000005}]
[null,null,null,null,"بار زنده سقف",null,null,null,null,null,null,"مساحت کل",null,null,null,null,null,null,"وزن",null,null,null,null,null,null,"وزن کل",null,null,null,null,null,null,null,null,null,4]
[null,null,null,null,null,null,null,null,null,null,null,{"$f":"I107","v":15},null,null,null,null,null,null,{"$f":"CHOOSE(AJ127,خلاصه!$D$13,خلاصه!$D$14,خلاصه!$D$15,خلاصه!$D$16,خلاصه!$D$17,خلاصه!$D$18,خلاصه!$D$19,خلاصه!$D$20,خلاصه!$D$21,خلاصه!$D$22)","v":150},null,null,null,null,null,null,{"$f":"I107*S128*0.001","v":2.25}]
[null,null,null,null,"بار مرده راه پله",null,null,null,null,null,null,"مساحت کل",null,null,null,null,null,null,"وزن",null,null,null,null,null,null,"وزن کل"]
[null,null,null,null,null,null,null,null,null,null,null,{"$f":"Q107","v":0},null,null,null,null,null,null,{"$f":"خلاصه!$F$12","v":690},null,null,null,null,null,null,{"$f":"L130*S130*0.001","v":0}]
[null,null,null,null,"بار زنده راه پله",null,null,null,null,null,null,"مساحت کل",null,null,null,null,null,null,"وزن",null,null,null,null,null,null,"وزن کل"]
[null,null,null,null,null,null,null,null,null,null,null,{"$f":"Q107","v":0},null,null,null,null,null,null,{"$f":"خلاصه!$D$12","v":350},null,null,null,null,null,null,{"$f":"L132*S132*0.001","v":0}]
[]
[null,null,null,null,"وزن کل",null,null,null,null,null,null,"کل بار مرده ",null,null,null,null,null,null,"کل بار زنده",null,null,null,null,null,null,"کل بار مرده وزنده"]
[null,null,null,null,null,null,null,null,null,null,null,{"$f":"Z114+Z116+Z118+Z120+Z122+Z124+Z126+Z130","v":28.925000000000004},null,null,null,null,null,null,{"$f":"Z132+Z128","v":2.25},null,null,null,null,null,null,{"$f":"L135+S135","v":31.175000000000004}]

{"sheet":"وزن سازه فولادی","index":24,"n_rows":134,"n_cols":36,"rows_kept":134,"cut":false,"hidden":false,"merged":[[132,4,133,10],[132,11,132,17],[132,18,132,24],[132,25,132,31],[133,11,133,17],[133,18,133,24],[133,25,133,31],[128,4,129,10],[128,11,128,17],[128,18,128,24],[128,25,128,31],[129,11,129,17],[129,18,129,24],[129,25,129,31],[126,4,127,10],[126,11,126,17],[126,18,126,24],[126,25,126,31],[127,11,127,17],[127,18,127,24],[127,25,127,31],[124,4,125,10],[124,11,124,17],[124,18,124,24],[124,25,124,31],[125,11,125,17],[125,18,125,24],[125,25,125,31],[122,4,123,10],[122,11,122,17],[122,18,122,24],[122,25,122,31],[123,11,123,17],[123,18,123,24],[123,25,123,31],[120,4,121,10],[120,11,120,17],[120,18,120,24],[120,25,120,31],[121,11,121,17],[121,18,121,24],[121,25,121,31],[118,4,119,10],[118,11,118,17],[118,18,118,24],[118,25,118,31],[119,11,119,17],[119,18,119,24],[119,25,119,31],[116,4,117,10],[116,11,116,17],[116,18,116,24],[116,25,116,31],[117,11,117,17],[117,18,117,24],[117,25,117,31],[114,4,115,10],[114,11,114,17],[114,18,114,24],[114,25,114,31],[115,11,115,17],[115,18,115,24],[115,25,115,31],[110,4,111,31],[112,4,113,10],[112,11,112,17],[112,18,112,24],[112,25,112,31],[113,11,113,17],[113,18,113,24],[113,25,113,31],[103,4,104,14],[103,15,104,31],[106,4,109,7],[106,8,106,15],[106,16,106,23],[106,24,106,31],[107,8,107,15],[107,16,107,23],[107,24,107,31],[108,8,108,15],[108,16,108,23],[108,24,108,31],[109,8,109,15],[109,16,109,23],[109,24,109,31],[98,4,99,10],[98,11,98,17],[98,18,98,24],[98,25,98,31],[99,11,99,17],[99,18,99,24],[99,25,99,31],[94,4,95,10],[94,11,94,17],[94,18,94,24],[94,25,94,31],[95,11,95,17],[95,18,95,24],[95,25,95,31],[92,4,93,10],[92,11,92,17],[92,18,92,24],[92,25,92,31],[93,11,93,17],[93,18,93,24],[93,25,93,31],[90,4,91,10],[90,11,90,17],[90,18,90,24],[90,25,90,31],[91,11,91,17],[91,18,91,24],[91,25,91,31],[88,4,89,10],[88,11,88,17],[88,18,88,24],[88,25,88,31],[89,11,89,17],[89,18,89,24],[89,25,89,31],[86,4,87,10],[86,11,86,17],[86,18,86,24],[86,25,86,31],[87,11,87,17],[87,18,87,24],[87,25,87,31],[84,4,85,10],[84,11,84,17],[84,18,84,24],[84,25,84,31],[85,11,85,17],[85,18,85,24],[85,25,85,31],[82,4,83,10],[82,11,82,17],[82,18,82,24],[82,25,82,31],[83,11,83,17],[83,18,83,24],[83,25,83,31],[80,4,81,10],[80,11,80,17],[80,18,80,24],[80,25,80,31],[81,11,81,17],[81,18,81,24],[81,25,81,31],[76,4,77,31],[78,4,79,10],[78,11,78,17],[78,18,78,24],[78,25,78,31],[79,11,79,17],[79,18,79,24],[79,25,79,31],[69,4,70,14],[69,15,70,31],[72,4,75,7],[72,8,72,15],[72,16,72,23],[72,24,72,31],[73,8,73,15],[73,16,73,23],[73,24,73,31],[74,8,74,15],[74,16,74,23],[74,24,74,31],[75,8,75,15],[75,16,75,23],[75,24,75,31],[64,4,65,10],[64,11,64,17],[64,18,64,24],[64,25,64,31],[65,11,65,17],[65,18,65,24],[65,25,65,31],[60,4,61,10],[60,11,60,17],[60,18,60,24],[60,25,60,31],[61,11,61,17],[61,18,61,24],[61,25,61,31],[58,4,59,10],[58,11,58,17],[58,18,58,24],[58,25,58,31],[59,11,59,17],[59,18,59,24],[59,25,59,31],[56,4,57,10],[56,11,56,17],[56,18,56,24],[56,25,56,31],[57,11,57,17],[57,18,57,24],[57,25,57,31],[54,4,55,10],[54,11,54,17],[54,18,54,24],[54,25,54,31],[55,11,55,17],[55,18,55,24],[55,25,55,31],[52,4,53,10],[52,11,52,17],[52,18,52,24],[52,25,52,31],[53,11,53,17],[53,18,53,24],[53,25,53,31],[50,4,51,10],[50,11,50,17],[50,18,50,24],[50,25,50,31],[51,11,51,17],[51,18,51,24],[51,25,51,31],[48,4,49,10],[48,11,48,17],[48,18,48,24],[48,25,48,31],[49,11,49,17],[49,18,49,24],[49,25,49,31],[46,4,47,10],[46,11,46,17],[46,18,46,24],[46,25,46,31],[47,11,47,17],[47,18,47,24],[47,25,47,31],[42,4,43,31],[44,4,45,10],[44,11,44,17],[44,18,44,24],[44,25,44,31],[45,11,45,17],[45,18,45,24],[45,25,45,31],[35,4,36,14],[35,15,36,31],[38,4,41,7],[38,8,38,15],[38,16,38,23],[38,24,38,31],[39,8,39,15],[39,16,39,23],[39,24,39,31],[40,8,40,15],[40,16,40,23],[40,24,40,31],[41,8,41,15],[41,16,41,23],[41,24,41,31],[1,4,2,14],[1,15,2,31],[4,8,4,15],[4,16,4,23],[4,24,4,31],[6,16,6,23],[6,24,6,31],[6,0,7,0],[7,8,7,15],[7,16,7,23],[7,24,7,31],[4,4,7,7],[5,8,5,15],[5,16,5,23],[5,24,5,31],[6,8,6,15],[11,25,11,31],[12,4,13,10],[12,11,12,17],[12,18,12,24],[12,25,12,31],[13,11,13,17],[13,18,13,24],[13,25,13,31],[10,4,11,10],[10,11,10,17],[10,18,10,24],[10,25,10,31],[11,11,11,17],[11,18,11,24],[14,18,14,24],[14,25,14,31],[15,11,15,17],[15,18,15,24],[15,25,15,31],[16,4,17,10],[16,11,16,17],[16,18,16,24],[16,25,16,31],[17,11,17,17],[17,18,17,24],[17,25,17,31],[30,4,31,10],[30,11,30,17],[30,18,30,24],[30,25,30,31],[31,11,31,17],[31,18,31,24],[31,25,31,31],[18,4,19,10],[18,11,18,17],[18,18,18,24],[18,25,18,31],[19,11,19,17],[19,18,19,24],[19,25,19,31],[20,4,21,10],[20,11,20,17],[20,18,20,24],[20,25,20,31],[21,11,21,17],[21,18,21,24],[21,25,21,31],[8,4,9,31],[26,4,27,10],[26,11,26,17],[26,18,26,24],[26,25,26,31],[27,11,27,17],[27,18,27,24],[27,25,27,31],[24,4,25,10],[24,11,24,17],[24,18,24,24],[24,25,24,31],[25,11,25,17],[25,18,25,24],[25,25,25,31],[22,4,23,10],[22,11,22,17],[22,18,22,24],[22,25,22,31],[23,11,23,17],[23,18,23,24],[23,25,23,31],[14,4,15,10],[14,11,14,17]]}
[]
[null,null,null,null,"تیپ 1:زیرزمین",null,null,null,null,null,null,null,null,null,null,"محاسبه وزن ساختمان در طبقه"]
[]
[]
[null,null,null,null,"مشخصات سازه",null,null,null,"مساحت سازه (m2)",null,null,null,null,null,null,null,"مساحت ایستگاه پله (m2)",null,null,null,null,null,null,null,"ارتفاع طبقه (m)"]
[null,null,null,null,null,null,null,null,145,null,null,null,null,null,null,null,15,null,null,null,null,null,null,null,3.2]
["وزن مخصوص بتن (ton/m3)",null,null,null,null,null,null,null,"ارتفاع مفید طبقه (m)",null,null,null,null,null,null,null,"وزن اعضا سازه ای(kg/m2)",null,null,null,null,null,null,null,"ضخامت دیوار برشی(cm)"]
[null,null,null,null,null,null,null,null,2.9,null,null,null,null,null,null,null,50,null,null,null,null,null,null,null,30]
[2.5,null,null,null,"وزن اجزا مختلف سازه"]
[]
[null,null,null,null,"دیوار نما",null,null,null,null,null,null,"طول کل",null,null,null,null,null,null,"وزن",null,null,null,null,null,null,"وزن کل"]
[null,null,null,null,null,null,null,null,null,null,null,0,null,null,null,null,null,null,{"$f":"خلاصه!$F$9","v":655},null,null,null,null,null,null,{"$f":"L12*S12*0.001","v":0}]
[null,null,null,null,"دیوار مجاور همسایه",null,null,null,null,null,null,"طول کل",null,null,null,null,null,null,"وزن",null,null,null,null,null,null,"وزن کل"]
[null,null,null,null,null,null,null,null,null,null,null,45,null,null,null,null,null,null,{"$f":"خلاصه!$F$8","v":775},null,null,null,null,null,null,{"$f":"L14*S14*0.001","v":34.875}]
[null,null,null,null,"دیوار جان پناه",null,null,null,null,null,null,"طول کل",null,null,null,null,null,null,"وزن",null,null,null,null,null,null,"وزن کل"]
[null,null,null,null,null,null,null,null,null,null,null,0,null,null,null,null,null,null,{"$f":"خلاصه!$F$10","v":265},null,null,null,null,null,null,{"$f":"L16*S16*0.001","v":0}]
[null,null,null,null,"دیوار برشی",null,null,null,null,null,null,"طول کل",null,null,null,null,null,null,"حجم ",null,null,null,null,null,null,"وزن کل"]
[null,null,null,null,null,null,null,null,null,null,null,0,null,null,null,null,null,null,{"$f":"L18*Y8*0.01*I8","v":0},null,null,null,null,null,null,{"$f":"S18*$A$9","v":0}]
[null,null,null,null,"بار مرده سقف",null,null,null,null,null,null,"مساحت کل",null,null,null,null,null,null,"وزن",null,null,null,null,null,null,"وزن کل",null,null,null,null,null,null,null,null,null,3]
[null,null,null,null,null,null,null,null,null,null,null,{"$f":"I6","v":145},null,null,null,null,null,null,{"$f":"CHOOSE(AJ19,خلاصه!$F$13,خلاصه!$F$14,خلاصه!$F$15,خلاصه!$F$16,خلاصه!$F$17,خلاصه!$F$18,خلاصه!$F$19,خلاصه!$F$20,خلاصه!$F$21,خلاصه!$F$22)","v":565},null,null,null,null,null,null,{"$f":"L20*S20*0.001","v":81.924999999999997}]
[null,null,null,null,"بار زنده سقف",null,null,null,null,null,null,"مساحت کل",null,null,null,null,null,null,"وزن",null,null,null,null,null,null,"وزن کل",null,null,null,null,null,null,null,null,null,3]
[null,null,null,null,null,null,null,null,null,null,null,{"$f":"I6","v":145},null,null,null,null,null,null,{"$f":"CHOOSE(AJ21,خلاصه!$D$13,خلاصه!$D$14,خلاصه!$D$15,خلاصه!$D$16,خلاصه!$D$17,خلاصه!$D$18,خلاصه!$D$19,خلاصه!$D$20,خلاصه!$D$21,خلاصه!$D$22)","v":200},null,null,null,null,null,null,{"$f":"I6*S22*0.001","v":29}]
[null,null,null,null,"بار مرده راه پله",null,null,null,null,null,null,"مساحت کل",null,null,null,null,null,null,"وزن",null,null,null,null,null,null,"وزن کل"]
[null,null,null,null,null,null,null,null,null,null,null,{"$f":"Q6","v":15},null,null,null,null,null,null,{"$f":"خلاصه!$F$12","v":690},null,null,null,null,null,null,{"$f":"L24*S24*0.001","v":10.35}]
[null,null,null,null,"بار زنده راه پله",null,null,null,null,null,null,"مساحت کل",null,null,null,null,null,null,"وزن",null,null,null,null,null,null,"وزن کل"]
[null,null,null,null,null,null,null,null,null,null,null,{"$f":"Q6","v":15},null,null,null,null,null,null,{"$f":"خلاصه!$D$12","v":350},null,null,null,null,null,null,{"$f":"L26*S26*0.001","v":5.25}]
[null,null,null,null,"بار اعضای سازه ای",null,null,null,null,null,null,"مساحت کل",null,null,null,null,null,null,"وزن",null,null,null,null,null,null,"وزن کل"]
[null,null,null,null,null,null,null,null,null,null,null,{"$f":"I6+Q6","v":160},null,null,null,null,null,null,{"$f":"Q8","v":50},null,null,null,null,null,null,{"$f":"L28*S28*0.001","v":8}]
[]
[]
[null,null,null,null,"وزن کل",null,null,null,null,null,null,"کل بار مرده ",null,null,null,null,null,null,"کل بار زنده",null,null,null,null,null,null,"کل بار مرده وزنده"]
[null,null,null,null,null,null,null,null,null,null,null,{"$f":"Z12+Z14+Z16+Z18+Z20+Z24+Z28","v":135.14999999999998},null,null,null,null,null,null,{"$f":"Z26+Z22","v":34.25},null,null,null,null,null,null,{"$f":"L32+S32","v":169.39999999999998}]
[]
[]
[]
[null,null,null,null,"تیپ 2:مسکونی",null,null,null,null,null,null,null,null,null,null,"محاسبه وزن ساختمان در طبقه"]
[]
[]
[null,null,null,null,"مشخصات سازه",null,null,null,"مساحت سازه (m2)",null,null,null,null,null,null,null,"مساحت ایستگاه پله (m2)",null,null,null,null,null,null,null,"ارتفاع طبقه (m)"]
[null,null,null,null,null,null,null,null,145,null,null,null,null,null,null,null,15,null,null,null,null,null,null,null,3.2]
[null,null,null,null,null,null,null,null,"ارتفاع مفید طبقه (m)",null,null,null,null,null,null,null,"وزن اعضا سازه ای(kg/m2)",null,null,null,null,null,null,null,"ضخامت دیوار برشی(cm)"]
[null,null,null,null,null,null,null,null,2.9,null,null,null,null,null,null,null,50,null,null,null,null,null,null,null,30]
[null,null,null,null,"وزن اجزا مختلف سازه"]
[]
[null,null,null,null,"دیوار نما",null,null,null,null,null,null,"طول کل",null,null,null,null,null,null,"وزن",null,null,null,null,null,null,"وزن کل"]
[null,null,null,null,null,null,null,null,null,null,null,14.25,null,null,null,null,null,null,{"$f":"خلاصه!$F$9","v":655},null,null,null,null,null,null,{"$f":"L46*S46*0.001","v":9.3337500000000002}]
[null,null,null,null,"دیوار مجاور همسایه",null,null,null,null,null,null,"طول کل",null,null,null,null,null,null,"وزن",null,null,null,null,null,null,"وزن کل"]
[null,null,null,null,null,null,null,null,null,null,null,18,null,null,null,null,null,null,{"$f":"خلاصه!$F$8","v":775},null,null,null,null,null,null,{"$f":"L48*S48*0.001","v":13.950000000000001}]
[null,null,null,null,"دیوار جان پناه",null,null,null,null,null,null,"طول کل",null,null,null,null,null,null,"وزن",null,null,null,null,null,null,"وزن کل"]
[null,null,null,null,null,null,null,null,null,null,null,0,null,null,null,null,null,null,{"$f":"خلاصه!$F$10","v":265},null,null,null,null,null,null,{"$f":"L50*S50*0.001","v":0}]
[null,null,null,null,"دیوار برشی",null,null,null,null,null,null,"طول کل",null,null,null,null,null,null,"حجم ",null,null,null,null,null,null,"وزن کل"]
[null,null,null,null,null,null,null,null,null,null,null,12,null,null,null,null,null,null,{"$f":"L52*Y42*0.01*I42","v":10.44},null,null,null,null,null,null,{"$f":"S52*$A$9","v":26.099999999999998}]
[null,null,null,null,"بار مرده سقف",null,null,null,null,null,null,"مساحت کل",null,null,null,null,null,null,"وزن",null,null,null,null,null,null,"وزن کل",null,null,null,null,null,null,null,null,null,3]
[null,null,null,null,null,null,null,null,null,null,null,{"$f":"I40","v":145},null,null,null,null,null,null,{"$f":"CHOOSE(AJ53,خلاصه!$F$13,خلاصه!$F$14,خلاصه!$F$15,خلاصه!$F$16,خلاصه!$F$17,خلاصه!$F$18,خلاصه!$F$19,خلاصه!$F$20,خلاصه!$F$21,خلاصه!$F$22)","v":565},null,null,null,null,null,null,{"$f":"L54*S54*0.001","v":81.924999999999997}]
[null,null,null,null,"بار زنده سقف",null,null,null,null,null,null,"مساحت کل",null,null,null,null,null,null,"وزن",null,null,null,null,null,null,"وزن کل",null,null,null,null,null,null,null,null,null,3]
[null,null,null,null,null,null,null,null,null,null,null,{"$f":"I40","v":145},null,null,null,null,null,null,{"$f":"CHOOSE(AJ55,خلاصه!$D$13,خلاصه!$D$14,خلاصه!$D$15,خلاصه!$D$16,خلاصه!$D$17,خلاصه!$D$18,خلاصه!$D$19,خلاصه!$D$20,خلاصه!$D$21,خلاصه!$D$22)","v":200},null,null,null,null,null,null,{"$f":"I40*S56*0.001","v":29}]
[null,null,null,null,"بار مرده راه پله",null,null,null,null,null,null,"مساحت کل",null,null,null,null,null,null,"وزن",null,null,null,null,null,null,"وزن کل"]
[null,null,null,null,null,null,null,null,null,null,null,{"$f":"Q40","v":15},null,null,null,null,null,null,{"$f":"خلاصه!$F$12","v":690},null,null,null,null,null,null,{"$f":"L58*S58*0.001","v":10.35}]
[null,null,null,null,"بار زنده راه پله",null,null,null,null,null,null,"مساحت کل",null,null,null,null,null,null,"وزن",null,null,null,null,null,null,"وزن کل"]
[null,null,null,null,null,null,null,null,null,null,null,{"$f":"Q40","v":15},null,null,null,null,null,null,{"$f":"خلاصه!$D$12","v":350},null,null,null,null,null,null,{"$f":"L60*S60*0.001","v":5.25}]
[null,null,null,null,"بار اعضای سازه ای",null,null,null,null,null,null,"مساحت کل",null,null,null,null,null,null,"وزن",null,null,null,null,null,null,"وزن کل"]
[null,null,null,null,null,null,null,null,null,null,null,{"$f":"I40+Q40","v":160},null,null,null,null,null,null,{"$f":"Q42","v":50},null,null,null,null,null,null,{"$f":"L62*S62*0.001","v":8}]
[]
[]
[null,null,null,null,"وزن کل",null,null,null,null,null,null,"کل بار مرده ",null,null,null,null,null,null,"کل بار زنده",null,null,null,null,null,null,"کل بار مرده وزنده"]
[null,null,null,null,null,null,null,null,null,null,null,{"$f":"Z46+Z48+Z50+Z52+Z54+Z58+Z62","v":149.65875},null,null,null,null,null,null,{"$f":"Z60+Z56","v":34.25},null,null,null,null,null,null,{"$f":"L66+S66","v":183.90875}]
[]
[]
[]
[null,null,null,null,"تیپ 3:بام",null,null,null,null,null,null,null,null,null,null,"محاسبه وزن ساختمان در طبقه"]
[]
[]
[null,null,null,null,"مشخصات سازه",null,null,null,"مساحت سازه (m2)",null,null,null,null,null,null,null,"مساحت ایستگاه پله (m2)",null,null,null,null,null,null,null,"ارتفاع طبقه (m)"]
[null,null,null,null,null,null,null,null,145,null,null,null,null,null,null,null,15,null,null,null,null,null,null,null,3.2]
[null,null,null,null,null,null,null,null,"ارتفاع مفید طبقه (m)",null,null,null,null,null,null,null,"وزن اعضا سازه ای(kg/m2)",null,null,null,null,null,null,null,"ضخامت دیوار برشی(cm)"]
[null,null,null,null,null,null,null,null,2.9,null,null,null,null,null,null,null,50,null,null,null,null,null,null,null,30]
[null,null,null,null,"وزن اجزا مختلف سازه"]
[]
[null,null,null,null,"دیوار نما",null,null,null,null,null,null,"طول کل",null,null,null,null,null,null,"وزن",null,null,null,null,null,null,"وزن کل"]
[null,null,null,null,null,null,null,null,null,null,null,14.25,null,null,null,null,null,null,{"$f":"خلاصه!$F$9","v":655},null,null,null,null,null,null,{"$f":"L80*S80*0.001","v":9.3337500000000002}]
[null,null,null,null,"دیوار مجاور همسایه",null,null,null,null,null,null,"طول کل",null,null,null,null,null,null,"وزن",null,null,null,null,null,null,"وزن کل"]
[null,null,null,null,null,null,null,null,null,null,null,18,null,null,null,null,null,null,{"$f":"خلاصه!$F$8","v":775},null,null,null,null,null,null,{"$f":"L82*S82*0.001","v":13.950000000000001}]
[null,null,null,null,"دیوار جان پناه",null,null,null,null,null,null,"طول کل",null,null,null,null,null,null,"وزن",null,null,null,null,null,null,"وزن کل"]
[null,null,null,null,null,null,null,null,null,null,null,45,null,null,null,null,null,null,{"$f":"خلاصه!$F$10","v":265},null,null,null,null,null,null,{"$f":"L84*S84*0.001","v":11.925000000000001}]
[null,null,null,null,"دیوار برشی",null,null,null,null,null,null,"طول کل",null,null,null,null,null,null,"حجم ",null,null,null,null,null,null,"وزن کل"]
[null,null,null,null,null,null,null,null,null,null,null,12,null,null,null,null,null,null,{"$f":"L86*Y76*0.01*I76","v":10.44},null,null,null,null,null,null,{"$f":"S86*$A$9","v":26.099999999999998}]
[null,null,null,null,"بار مرده سقف",null,null,null,null,null,null,"مساحت کل",null,null,null,null,null,null,"وزن",null,null,null,null,null,null,"وزن کل",null,null,null,null,null,null,null,null,null,4]
[null,null,null,null,null,null,null,null,null,null,null,{"$f":"I74","v":145},null,null,null,null,null,null,{"$f":"CHOOSE(AJ87,خلاصه!$F$13,خلاصه!$F$14,خلاصه!$F$15,خلاصه!$F$16,خلاصه!$F$17,خلاصه!$F$18,خلاصه!$F$19,خلاصه!$F$20,خلاصه!$F$21,خلاصه!$F$22)","v":515},null,null,null,null,null,null,{"$f":"L88*S88*0.001","v":74.674999999999997}]
[null,null,null,null,"بار زنده سقف",null,null,null,null,null,null,"مساحت کل",null,null,null,null,null,null,"وزن",null,null,null,null,null,null,"وزن کل",null,null,null,null,null,null,null,null,null,4]
[null,null,null,null,null,null,null,null,null,null,null,{"$f":"I74","v":145},null,null,null,null,null,null,{"$f":"CHOOSE(AJ89,خلاصه!$D$13,خلاصه!$D$14,خلاصه!$D$15,خلاصه!$D$16,خلاصه!$D$17,خلاصه!$D$18,خلاصه!$D$19,خلاصه!$D$20,خلاصه!$D$21,خلاصه!$D$22)","v":150},null,null,null,null,null,null,{"$f":"I74*S90*0.001","v":21.75}]
[null,null,null,null,"بار مرده راه پله",null,null,null,null,null,null,"مساحت کل",null,null,null,null,null,null,"وزن",null,null,null,null,null,null,"وزن کل"]
[null,null,null,null,null,null,null,null,null,null,null,{"$f":"Q74","v":15},null,null,null,null,null,null,{"$f":"خلاصه!$F$12","v":690},null,null,null,null,null,null,{"$f":"L92*S92*0.001","v":10.35}]
[null,null,null,null,"بار زنده راه پله",null,null,null,null,null,null,"مساحت کل",null,null,null,null,null,null,"وزن",null,null,null,null,null,null,"وزن کل"]
[null,null,null,null,null,null,null,null,null,null,null,{"$f":"Q74","v":15},null,null,null,null,null,null,{"$f":"خلاصه!$D$12","v":350},null,null,null,null,null,null,{"$f":"L94*S94*0.001","v":5.25}]
[null,null,null,null,"بار اعضای سازه ای",null,null,null,null,null,null,"مساحت کل",null,null,null,null,null,null,"وزن",null,null,null,null,null,null,"وزن کل"]
[null,null,null,null,null,null,null,null,null,null,null,{"$f":"I74+Q74","v":160},null,null,null,null,null,null,{"$f":"Q76","v":50},null,null,null,null,null,null,{"$f":"L96*S96*0.001","v":8}]
[]
[]
[null,null,null,null,"وزن کل",null,null,null,null,null,null,"کل بار مرده ",null,null,null,null,null,null,"کل بار زنده",null,null,null,null,null,null,"کل بار مرده وزنده"]
[null,null,null,null,null,null,null,null,null,null,null,{"$f":"Z80+Z82+Z84+Z86+Z88+Z92+Z96","v":154.33374999999998},null,null,null,null,null,null,{"$f":"Z94+Z90","v":27},null,null,null,null,null,null,{"$f":"L100+S100","v":181.33374999999998}]
[]
[]
[]
[null,null,null,null,"تیپ 4:خرپشته",null,null,null,null,null,null,null,null,null,null,"محاسبه وزن ساختمان در طبقه"]
[]
[]
[null,null,null,null,"مشخصات سازه",null,null,null,"مساحت سازه (m2)",null,null,null,null,null,null,null,"مساحت ایستگاه پله (m2)",null,null,null,null,null,null,null,"ارتفاع طبقه (m)"]
[null,null,null,null,null,null,null,null,145,null,null,null,null,null,null,null,15,null,null,null,null,null,null,null,3.2]
[null,null,null,null,null,null,null,null,"ارتفاع مفید طبقه (m)",null,null,null,null,null,null,null,"وزن اعضا سازه ای(kg/m2)",null,null,null,null,null,null,null,"ضخامت دیوار برشی(cm)"]
[null,null,null,null,null,null,null,null,2.9,null,null,null,null,null,null,null,50,null,null,null,null,null,null,null,30]
[null,null,null,null,"وزن اجزا مختلف سازه"]
[]
[null,null,null,null,"دیوار نما",null,null,null,null,null,null,"طول کل",null,null,null,null,null,null,"وزن",null,null,null,null,null,null,"وزن کل"]
[null,null,null,null,null,null,null,null,null,null,null,0,null,null,null,null,null,null,{"$f":"خلاصه!$F$9","v":655},null,null,null,null,null,null,{"$f":"L114*S114*0.001","v":0}]
[null,null,null,null,"دیوار مجاور همسایه",null,null,null,null,null,null,"طول کل",null,null,null,null,null,null,"وزن",null,null,null,null,null,null,"وزن کل"]
[null,null,null,null,null,null,null,null,null,null,null,15,null,null,null,null,null,null,{"$f":"خلاصه!$F$8","v":775},null,null,null,null,null,null,{"$f":"L116*S116*0.001","v":11.625}]
[null,null,null,null,"دیوار جان پناه",null,null,null,null,null,null,"طول کل",null,null,null,null,null,null,"وزن",null,null,null,null,null,null,"وزن کل"]
[null,null,null,null,null,null,null,null,null,null,null,0,null,null,null,null,null,null,{"$f":"خلاصه!$F$10","v":265},null,null,null,null,null,null,{"$f":"L118*S118*0.001","v":0}]
[null,null,null,null,"دیوار برشی",null,null,null,null,null,null,"طول کل",null,null,null,null,null,null,"حجم ",null,null,null,null,null,null,"وزن کل"]
[null,null,null,null,null,null,null,null,null,null,null,0,null,null,null,null,null,null,{"$f":"L120*Y110*0.01*I110","v":0},null,null,null,null,null,null,{"$f":"S120*$A$9","v":0}]
[null,null,null,null,"بار مرده سقف",null,null,null,null,null,null,"مساحت کل",null,null,null,null,null,null,"وزن",null,null,null,null,null,null,"وزن کل",null,null,null,null,null,null,null,null,null,3]
[null,null,null,null,null,null,null,null,null,null,null,15,null,null,null,null,null,null,{"$f":"CHOOSE(AJ121,خلاصه!$F$13,خلاصه!$F$14,خلاصه!$F$15,خلاصه!$F$16,خلاصه!$F$17,خلاصه!$F$18,خلاصه!$F$19,خلاصه!$F$20,خلاصه!$F$21,خلاصه!$F$22)","v":565},null,null,null,null,null,null,{"$f":"L122*S122*0.001","v":8.4749999999999996}]
[null,null,null,null,"بار زنده سقف",null,null,null,null,null,null,"مساحت کل",null,null,null,null,null,null,"وزن",null,null,null,null,null,null,"وزن کل",null,null,null,null,null,null,null,null,null,3]
[null,null,null,null,null,null,null,null,null,null,null,15,null,null,null,null,null,null,{"$f":"CHOOSE(AJ123,خلاصه!$D$13,خلاصه!$D$14,خلاصه!$D$15,خلاصه!$D$16,خلاصه!$D$17,خلاصه!$D$18,خلاصه!$D$19,خلاصه!$D$20,خلاصه!$D$21,خلاصه!$D$22)","v":200},null,null,null,null,null,null,{"$f":"I108*S124*0.001","v":29}]
[null,null,null,null,"بار مرده راه پله",null,null,null,null,null,null,"مساحت کل",null,null,null,null,null,null,"وزن",null,null,null,null,null,null,"وزن کل"]
[null,null,null,null,null,null,null,null,null,null,null,0,null,null,null,null,null,null,{"$f":"خلاصه!$F$12","v":690},null,null,null,null,null,null,{"$f":"L126*S126*0.001","v":0}]
[null,null,null,null,"بار زنده راه پله",null,null,null,null,null,null,"مساحت کل",null,null,null,null,null,null,"وزن",null,null,null,null,null,null,"وزن کل"]
[null,null,null,null,null,null,null,null,null,null,null,0,null,null,null,null,null,null,{"$f":"خلاصه!$D$12","v":350},null,null,null,null,null,null,{"$f":"L128*S128*0.001","v":0}]
[null,null,null,null,"بار اعضای سازه ای",null,null,null,null,null,null,"مساحت کل",null,null,null,null,null,null,"وزن",null,null,null,null,null,null,"وزن کل"]
[null,null,null,null,null,null,null,null,null,null,null,15,null,null,null,null,null,null,{"$f":"Q110","v":50},null,null,null,null,null,null,{"$f":"L130*S130*0.001","v":0.75}]
[]
[]
[null,null,null,null,"وزن کل",null,null,null,null,null,null,"کل بار مرده ",null,null,null,null,null,null,"کل بار زنده",null,null,null,null,null,null,"کل بار مرده وزنده"]
[null,null,null,null,null,null,null,null,null,null,null,{"$f":"Z114+Z116+Z118+Z120+Z122+Z126+Z130","v":20.85},null,null,null,null,null,null,{"$f":"Z128+Z124","v":29},null,null,null,null,null,null,{"$f":"L134+S134","v":49.85}]

{"sheet":"3 طبقه","index":25,"n_rows":93,"n_cols":44,"rows_kept":93,"cut":false,"hidden":false,"merged":[[88,6,89,8],[88,11,88,24],[89,11,91,24],[92,6,93,8],[92,11,92,24],[84,6,85,8],[84,11,84,24],[85,11,87,24],[76,6,77,8],[76,11,76,24],[77,11,79,24],[68,6,69,8],[68,11,68,24],[69,11,71,24],[72,6,73,8],[72,11,72,24],[73,11,75,24],[60,4,61,11],[60,12,60,16],[60,17,60,21],[60,22,60,26],[60,27,61,31],[61,12,61,16],[61,17,61,21],[61,22,61,26],[57,20,57,25],[57,26,57,31],[56,4,56,7],[56,8,56,13],[56,14,56,19],[56,20,56,25],[56,26,56,31],[54,4,54,7],[54,8,54,13],[54,14,54,19],[54,20,54,25],[54,26,54,31],[55,4,55,7],[55,8,55,13],[55,14,55,19],[55,20,55,25],[55,26,55,31],[52,4,52,31],[53,4,53,7],[53,8,53,13],[53,14,53,19],[53,20,53,25],[53,26,53,31],[49,4,50,11],[49,12,49,16],[49,17,49,21],[49,22,49,26],[49,27,50,31],[50,12,50,16],[50,17,50,21],[50,22,50,26],[46,20,46,25],[46,26,46,31],[45,4,45,7],[45,8,45,13],[45,14,45,19],[45,20,45,25],[45,26,45,31],[43,4,43,7],[43,8,43,13],[43,14,43,19],[43,20,43,25],[43,26,43,31],[44,4,44,7],[44,8,44,13],[44,14,44,19],[44,20,44,25],[44,26,44,31],[41,4,41,31],[42,4,42,7],[42,8,42,13],[42,14,42,19],[42,20,42,25],[42,26,42,31],[40,4,40,7],[38,4,38,7],[38,8,38,13],[38,14,38,19],[38,20,38,25],[38,26,38,31],[36,4,36,7],[36,8,36,13],[36,14,36,19],[36,20,36,25],[36,26,36,31],[37,4,37,7],[37,8,37,13],[37,14,37,19],[37,20,37,25],[37,26,37,31],[33,4,33,14],[33,15,33,17],[33,18,33,28],[33,29,33,31],[35,4,35,7],[35,8,35,13],[35,14,35,19],[35,20,35,25],[35,26,35,31],[26,17,26,21],[26,22,26,26],[26,27,26,31],[30,4,30,31],[32,4,32,17],[32,18,32,31],[25,4,25,7],[25,8,25,12],[25,13,25,16],[25,17,25,21],[25,22,25,26],[25,27,25,31],[24,4,24,7],[24,8,24,12],[24,13,24,16],[24,17,24,21],[24,22,24,26],[24,27,24,31],[22,27,22,31],[23,4,23,7],[23,8,23,12],[23,13,23,16],[23,17,23,21],[23,22,23,26],[23,27,23,31],[19,17,19,21],[19,22,19,26],[19,27,19,31],[21,4,21,31],[22,4,22,7],[22,8,22,12],[22,13,22,16],[22,17,22,21],[22,22,22,26],[18,4,18,7],[18,8,18,12],[18,13,18,16],[18,17,18,21],[18,22,18,26],[18,27,18,31],[17,4,17,7],[17,8,17,12],[17,13,17,16],[17,17,17,21],[17,22,17,26],[17,27,17,31],[16,4,16,7],[16,8,16,12],[16,13,16,16],[16,17,16,21],[16,22,16,26],[16,27,16,31],[14,4,14,31],[15,4,15,7],[15,8,15,12],[15,13,15,16],[15,17,15,21],[15,22,15,26],[15,27,15,31],[11,4,11,10],[11,11,11,17],[11,18,11,24],[11,25,11,31],[12,4,12,10],[12,11,12,17],[12,18,12,24],[12,25,12,31],[9,20,9,25],[9,26,9,31],[5,4,5,7],[5,8,5,13],[5,14,5,19],[5,20,5,25],[5,26,5,31],[8,4,8,7],[8,8,8,13],[8,14,8,19],[8,20,8,25],[8,26,8,31],[6,4,6,7],[6,8,6,13],[6,14,6,19],[6,20,6,25],[6,26,6,31],[7,4,7,7],[7,8,7,13],[7,14,7,19],[7,20,7,25],[7,26,7,31],[0,35,0,37],[0,38,0,40],[0,41,0,43],[1,0,1,1],[1,3,2,32],[3,4,3,31],[4,4,4,7],[4,8,4,13],[4,14,4,19],[4,20,4,25],[4,26,4,31]]}
[null,null,null,null,null,null,null,null,null,null,null,null,null,null,null,null,null,null,null,null,null,null,null,null,null,null,null,null,null,null,null,null,null,null,null,"بتنی",null,null,"فولادی",null,null,"select"]
["سیستم سازه",null,null,"محاسبه و تقسیم بار زلزله",null,null,null,null,null,null,null,null,null,null,null,null,null,null,null,null,null,null,null,null,null,null,null,null,null,null,null,null,null,null,null,{"$f":"'وزن سازه بتنی'!E2","v":"تیپ 1:پارکینگ"},{"$f":"'وزن سازه بتنی'!L33","v":174.25874999999999},{"$f":"'وزن سازه بتنی'!S33","v":34.25},{"$f":"'وزن سازه فولادی'!E2","v":"تیپ 1:زیرزمین"},{"$f":"'وزن سازه فولادی'!L32","v":135.14999999999998},{"$f":"'وزن سازه فولادی'!S32","v":34.25},{"$f":"IF($AL$6=1,AM2,AJ2)","v":"تیپ 1:زیرزمین"},135.14999999999998,34.25]
[null,null,null,null,null,null,null,null,null,null,null,null,null,null,null,null,null,null,null,null,null,null,null,null,null,null,null,null,null,null,null,null,null,null,null,{"$f":"'وزن سازه بتنی'!E36","v":"تیپ 2:مسکونی"},{"$f":"'وزن سازه بتنی'!L67","v":183.01874999999998},{"$f":"'وزن سازه بتنی'!S67","v":34.25},{"$f":"'وزن سازه فولادی'!E36","v":"تیپ 2:مسکونی"},{"$f":"'وزن سازه فولادی'!L66","v":149.65875},{"$f":"'وزن سازه فولادی'!S66","v":34.25},"تیپ 2:مسکونی",149.65875,34.25]
[null,null,null,null,"جهت تعیین بار جانبی زلزله ابتدا باید وزن سازه و ضریب زازله را بدست آوریم:",null,null,null,null,null,null,null,null,null,null,null,null,null,null,null,null,null,null,null,null,null,null,null,null,null,null,null,null,null,null,{"$f":"'وزن سازه بتنی'!E70","v":"تیپ 3:بام"},{"$f":"'وزن سازه بتنی'!L101","v":184.77374999999998},{"$f":"'وزن سازه بتنی'!S101","v":27},{"$f":"'وزن سازه فولادی'!E70","v":"تیپ 3:بام"},{"$f":"'وزن سازه فولادی'!L100","v":154.33374999999998},{"$f":"'وزن سازه فولادی'!S100","v":27},"تیپ 3:بام",154.33374999999998,27]
[null,null,null,null,"شماره طبقه",null,null,null,"بار مرده",null,null,null,null,null,"بار زنده",null,null,null,null,null,"درصد مشارکت یار زنده",null,null,null,null,null,"مجموع بار مرده و زنده",null,null,null,null,null,null,null,null,{"$f":"'وزن سازه بتنی'!E104","v":"تیپ 4:خرپشته"},{"$f":"'وزن سازه بتنی'!L135","v":28.925000000000004},{"$f":"'وزن سازه بتنی'!S135","v":2.25},{"$f":"'وزن سازه فولادی'!E104","v":"تیپ 4:خرپشته"},{"$f":"'وزن سازه فولادی'!L134","v":20.85},{"$f":"'وزن سازه فولادی'!S134","v":29},"تیپ 4:خرپشته",20.85,29]
[null,null,null,null,"طبقه اول",null,null,null,{"$f":"CHOOSE(AJ6,$AQ$2,$AQ$3,$AQ$4,$AQ$5)","v":135.14999999999998},null,null,null,null,null,{"$f":"CHOOSE(AJ6,$AR$2,$AR$3,$AR$4,$AR$5)","v":34.25},null,null,null,null,null,0.2,null,null,null,null,null,{"$f":"I6+O6*U6","v":141.99999999999997},null,null,null,null,null,null,null,null,1,null,1]
[null,null,null,null,"طبقه دوم",null,null,null,149.65875,null,null,null,null,null,34.25,null,null,null,null,null,0.2,null,null,null,null,null,{"$f":"I7+O7*U7","v":156.50874999999999},null,null,null,null,null,null,null,null,2]
[null,null,null,null,"طبقه سوم",null,null,null,154.33374999999998,null,null,null,null,null,27,null,null,null,null,null,0.2,null,null,null,null,null,159.73374999999999,null,null,null,null,null,null,null,null,3]
[null,null,null,null,"خرپشته",null,null,null,20.85,null,null,null,null,null,29,null,null,null,null,null,0.2,null,null,null,null,null,26.650000000000002,null,null,null,null,null,null,null,null,4]
[null,null,null,null,null,null,null,null,null,null,null,null,null,null,null,null,null,null,null,null,"مجموع وزن سازه",null,null,null,null,null,{"$f":"AA6+AA7+AA8+AA9","v":484.89249999999993}]
[]
[null,null,null,null,"ضریب زلزله در جهت X",null,null,null,null,null,null,null,null,null,null,null,null,null,"ضریب زلزله در جهت Y"]
[null,null,null,null,{"$f":"خلاصه!H29","v":0.11609999999999999},null,null,null,null,null,null,{"$f":"AA10*E13","v":56.296019249999986},null,null,null,null,null,null,{"$f":"خلاصه!D29","v":9.2700000000000005E-2},null,null,null,null,null,null,{"$f":"AA10*S13","v":44.949534749999998}]
[]
[null,null,null,null,"توزیع نیروی برشی در جهت X"]
[null,null,null,null,"شماره طبقه",null,null,null,"وزن طبقه",null,null,null,null,"ارتفاع طبقه",null,null,null,"ارتفاع از تراز پایه",null,null,null,null,"Wi×Hi",null,null,null,null,"Fi"]
[null,null,null,null,"طبقه اول",null,null,null,{"$f":"AA6","v":141.99999999999997},null,null,null,null,2.8,null,null,null,{"$f":"N17","v":2.8},null,null,null,null,{"$f":"I17*R17","v":397.59999999999991},null,null,null,null,{"$f":"$L$13*W17/$W$20","v":7.590141933921827}]
[null,null,null,null,"طبقه دوم",null,null,null,{"$f":"AA7","v":156.50874999999999},null,null,null,null,3.5,null,null,null,{"$f":"R17+N18","v":6.3},null,null,null,null,{"$f":"I18*R18","v":986.00512499999991},null,null,null,null,{"$f":"$L$13*W18/$W$20","v":18.822733516912312}]
[null,null,null,null,"طبقه سوم",null,null,null,159.73374999999999,null,null,null,null,3.5,null,null,null,{"$f":"R18+N19","v":9.8000000000000007},null,null,null,null,1565.39075,null,null,null,null,{"$f":"$L$13*W19/$W$20","v":29.88314379916585}]
[null,null,null,null,null,null,null,null,null,null,null,null,null,null,null,null,null,"ΣWi×Hi=",null,null,null,null,{"$f":"W17+W18+W19","v":2948.9958749999996},null,null,null,null,{"$f":"AB17+AB18+AB19","v":56.296019249999986}]
[]
[null,null,null,null,"توزیع نیروی برشی در جهت Y"]
[null,null,null,null,"شماره طبقه",null,null,null,"وزن طبقه",null,null,null,null,"ارتفاع طبقه",null,null,null,"ارتفاع از تراز پایه",null,null,null,null,"Wi×Hi",null,null,null,null,"Fi"]
[null,null,null,null,"طبقه اول",null,null,null,{"$f":"AA6","v":141.99999999999997},null,null,null,null,{"$f":"N17","v":2.8},null,null,null,{"$f":"N24","v":2.8},null,null,null,null,{"$f":"I24*R24","v":397.59999999999991},null,null,null,null,{"$f":"$Z$13*W24/$W$27","v":6.0603458852244065}]
[null,null,null,null,"طبقه دوم",null,null,null,{"$f":"AA7","v":156.50874999999999},null,null,null,null,{"$f":"N18","v":3.5},null,null,null,{"$f":"R24+N25","v":6.3},null,null,null,null,{"$f":"I25*R25","v":986.00512499999991},null,null,null,null,{"$f":"$Z$13*W25/$W$27","v":15.02900428094549}]
[null,null,null,null,"طبقه سوم",null,null,null,159.73374999999999,null,null,null,null,3.5,null,null,null,{"$f":"R25+N26","v":9.8000000000000007},null,null,null,null,1565.39075,null,null,null,null,{"$f":"$Z$13*W26/$W$27","v":23.860184583830105}]
[null,null,null,null,null,null,null,null,null,null,null,null,null,null,null,null,null,"ΣWi×Hi=",null,null,null,null,{"$f":"W24+W25+W26","v":2948.9958749999996},null,null,null,null,{"$f":"AB24+AB25+AB26","v":44.949534749999998}]
[]
[]
[]
[null,null,null,null,"پخش نیروهای هر تراز بین قاب ها"]
[]
[null,null,null,null,"در جهت X",null,null,null,null,null,null,null,null,null,null,null,null,null,"در جهت Y"]
[null,null,null,null,"سهم قاب مورد نظر از نیروی جانبی (درصد)",null,null,null,null,null,null,null,null,null,null,0.2,null,null,"سهم قاب مورد نظر از نیروی جانبی (درصد)",null,null,null,null,null,null,null,null,null,null,0.3]
[]
[null,null,null,null,"شماره طبقه",null,null,null,"نیرو در جهت X",null,null,null,null,null,"نیرو در جهت Y",null,null,null,null,null,"نیروی جانبی در جهت X",null,null,null,null,null,"نیروی جانبی در جهت Y"]
[null,null,null,null,"طبقه اول",null,null,null,{"$f":"AB17","v":7.590141933921827},null,null,null,null,null,{"$f":"AB24","v":6.0603458852244065},null,null,null,null,null,{"$f":"I37*$P$34","v":1.5180283867843656},null,null,null,null,null,{"$f":"O37*$AD$34","v":1.8181037655673218}]
[null,null,null,null,"طبقه دوم",null,null,null,{"$f":"AB18","v":18.822733516912312},null,null,null,null,null,{"$f":"AB25","v":15.02900428094549},null,null,null,null,null,{"$f":"I38*$P$34","v":3.7645467033824627},null,null,null,null,null,{"$f":"O38*$AD$34","v":4.5087012842836467}]
[null,null,null,null,"طبقه سوم",null,null,null,29.88314379916585,null,null,null,null,null,23.860184583830105,null,null,null,null,null,5.9766287598331704,null,null,null,null,null,7.158055375149031]
[]
[]
[null,null,null,null,"محاسبه لنگر واژگونی در جهت X"]
[null,null,null,null,"شماره طبقه",null,null,null,"ارتفاع طبقه",null,null,null,null,null,"ارتفاع از تراز پابه",null,null,null,null,null,"Fi",null,null,null,null,null,"Fi × Hi"]
[null,null,null,null,"طبقه اول",null,null,null,{"$f":"N17","v":2.8},null,null,null,null,null,{"$f":"I44","v":2.8},null,null,null,null,null,{"$f":"AB17","v":7.590141933921827},null,null,null,null,null,{"$f":"O44*U44","v":21.252397414981115}]
[null,null,null,null,"طبقه دوم",null,null,null,{"$f":"N18","v":3.5},null,null,null,null,null,{"$f":"O44+I45","v":6.3},null,null,null,null,null,{"$f":"AB18","v":18.822733516912312},null,null,null,null,null,{"$f":"O45*U45","v":118.58322115654757}]
[null,null,null,null,"طبقه سوم",null,null,null,3.5,null,null,null,null,null,{"$f":"O45+I46","v":9.8000000000000007},null,null,null,null,null,29.88314379916585,null,null,null,null,null,292.85480923182536]
[null,null,null,null,null,null,null,null,null,null,null,null,null,null,null,null,null,null,null,null,"Σ=",null,null,null,null,null,{"$f":"AA44+AA45+AA46","v":432.69042780335405}]
[]
[]
[null,null,null,null,"محاسبه لنگر مقاوم در جهت X",null,null,null,null,null,null,null,"وزن سازه",null,null,null,null,"مرکز سطح  X",null,null,null,null,"Mrx",null,null,null,null,{"$f":"IF(W51/AA47>1.75,\"OK\",\"N.OK\")","v":"OK"}]
[null,null,null,null,null,null,null,null,null,null,null,null,{"$f":"AA10","v":484.89249999999993},null,null,null,null,4.2,null,null,null,null,{"$f":"M51*R51","v":2036.5484999999999}]
[]
[null,null,null,null,"محاسبه لنگر واژگونی در جهت Y"]
[null,null,null,null,"شماره طبقه",null,null,null,"ارتفاع طبقه",null,null,null,null,null,"ارتفاع از تراز پابه",null,null,null,null,null,"Fi",null,null,null,null,null,"Fi × Hi"]
[null,null,null,null,"طبقه اول",null,null,null,{"$f":"N17","v":2.8},null,null,null,null,null,{"$f":"I55","v":2.8},null,null,null,null,null,{"$f":"AB24","v":6.0603458852244065},null,null,null,null,null,{"$f":"O55*U55","v":16.968968478628337}]
[null,null,null,null,"طبقه دوم",null,null,null,{"$f":"N18","v":3.5},null,null,null,null,null,{"$f":"O55+I56","v":6.3},null,null,null,null,null,{"$f":"AB25","v":15.02900428094549},null,null,null,null,null,{"$f":"O56*U56","v":94.682726969956576}]
[null,null,null,null,"طبقه سوم",null,null,null,3.5,null,null,null,null,null,{"$f":"O56+I57","v":9.8000000000000007},null,null,null,null,null,23.860184583830105,null,null,null,null,null,233.82980892153503]
[null,null,null,null,null,null,null,null,null,null,null,null,null,null,null,null,null,null,null,null,"Σ=",null,null,null,null,null,{"$f":"AA55+AA56+AA57","v":345.48150437011998}]
[]
[]
[null,null,null,null,"محاسبه لنگر مقاوم در جهت Y",null,null,null,null,null,null,null,"وزن سازه",null,null,null,null,"مرکز سطح  Y",null,null,null,null,"Mry",null,null,null,null,{"$f":"IF(W62/AA58>1.75,\"OK\",\"N.OK\")","v":"OK"}]
[null,null,null,null,null,null,null,null,null,null,null,null,{"$f":"AA10","v":484.89249999999993},null,null,null,null,7.2,null,null,null,null,{"$f":"M62*R62","v":3491.2259999999997}]
[]
[]
[]
[]
[]
[]
[null,null,null,null,null,null,{"$f":"U39","v":5.9766287598331704},null,null,null,null,"3 st"]
[]
[]
[]
[null,null,null,null,null,null,{"$f":"U38","v":3.7645467033824627},null,null,null,null,"2 st"]
[]
[]
[]
[null,null,null,null,null,null,{"$f":"U37","v":1.5180283867843656},null,null,null,null,"1 st"]
[]
[]
[]
[]
[]
[]
[]
[null,null,null,null,null,null,{"$f":"AA39","v":7.158055375149031},null,null,null,null,"3 st"]
[]
[]
[]
[null,null,null,null,null,null,{"$f":"AA38","v":4.5087012842836467},null,null,null,null,"2 st"]
[]
[]
[]
[null,null,null,null,null,null,{"$f":"AA37","v":1.8181037655673218},null,null,null,null,"1 st"]

{"sheet":"4 طبقه","index":26,"n_rows":96,"n_cols":44,"rows_kept":96,"cut":false,"hidden":false,"merged":[[91,6,92,8],[91,11,91,24],[92,11,94,24],[95,6,96,8],[95,11,95,24],[83,6,84,8],[83,11,83,24],[84,11,86,24],[87,6,88,8],[87,11,87,24],[88,11,90,24],[79,6,80,8],[79,11,79,24],[80,11,81,24],[71,6,72,8],[71,11,71,24],[72,11,74,24],[75,6,76,8],[75,11,75,24],[76,11,78,24],[67,6,68,8],[67,11,67,24],[68,11,70,24],[62,4,63,11],[62,12,62,16],[62,17,62,21],[62,22,62,26],[62,27,63,31],[63,12,63,16],[63,17,63,21],[63,22,63,26],[60,20,60,25],[60,26,60,31],[58,4,58,7],[58,8,58,13],[58,14,58,19],[58,20,58,25],[58,26,58,31],[59,4,59,7],[59,8,59,13],[59,14,59,19],[59,20,59,25],[59,26,59,31],[56,4,56,7],[56,8,56,13],[56,14,56,19],[56,20,56,25],[56,26,56,31],[57,4,57,7],[57,8,57,13],[57,14,57,19],[57,20,57,25],[57,26,57,31],[54,4,54,31],[55,4,55,7],[55,8,55,13],[55,14,55,19],[55,20,55,25],[55,26,55,31],[51,4,52,11],[51,12,51,16],[51,17,51,21],[51,22,51,26],[51,27,52,31],[52,12,52,16],[52,17,52,21],[52,22,52,26],[49,20,49,25],[49,26,49,31],[47,4,47,7],[47,8,47,13],[47,14,47,19],[47,20,47,25],[47,26,47,31],[48,4,48,7],[48,8,48,13],[48,14,48,19],[48,20,48,25],[48,26,48,31],[45,4,45,7],[45,8,45,13],[45,14,45,19],[45,20,45,25],[45,26,45,31],[46,4,46,7],[46,8,46,13],[46,14,46,19],[46,20,46,25],[46,26,46,31],[43,4,43,31],[44,4,44,7],[44,8,44,13],[44,14,44,19],[44,20,44,25],[44,26,44,31],[42,4,42,7],[40,4,40,7],[40,8,40,13],[40,14,40,19],[40,20,40,25],[40,26,40,31],[41,4,41,7],[41,8,41,13],[41,14,41,19],[41,20,41,25],[41,26,41,31],[38,4,38,7],[38,8,38,13],[38,14,38,19],[38,20,38,25],[38,26,38,31],[39,4,39,7],[39,8,39,13],[39,14,39,19],[39,20,39,25],[39,26,39,31],[35,4,35,14],[35,15,35,17],[35,18,35,28],[35,29,35,31],[37,4,37,7],[37,8,37,13],[37,14,37,19],[37,20,37,25],[37,26,37,31],[30,17,30,21],[30,22,30,26],[30,27,30,31],[33,4,33,31],[34,4,34,17],[34,18,34,31],[29,4,29,7],[29,8,29,12],[29,13,29,16],[29,17,29,21],[29,22,29,26],[29,27,29,31],[28,4,28,7],[28,8,28,12],[28,13,28,16],[28,17,28,21],[28,22,28,26],[28,27,28,31],[27,4,27,7],[27,8,27,12],[27,13,27,16],[27,17,27,21],[27,22,27,26],[27,27,27,31],[25,27,25,31],[26,4,26,7],[26,8,26,12],[26,13,26,16],[26,17,26,21],[26,22,26,26],[26,27,26,31],[22,17,22,21],[22,22,22,26],[22,27,22,31],[24,4,24,31],[25,4,25,7],[25,8,25,12],[25,13,25,16],[25,17,25,21],[25,22,25,26],[21,4,21,7],[21,8,21,12],[21,13,21,16],[21,17,21,21],[21,22,21,26],[21,27,21,31],[20,4,20,7],[20,8,20,12],[20,13,20,16],[20,17,20,21],[20,22,20,26],[20,27,20,31],[19,4,19,7],[19,8,19,12],[19,13,19,16],[19,17,19,21],[19,22,19,26],[19,27,19,31],[18,4,18,7],[18,8,18,12],[18,13,18,16],[18,17,18,21],[18,22,18,26],[18,27,18,31],[16,4,16,31],[17,4,17,7],[17,8,17,12],[17,13,17,16],[17,17,17,21],[17,22,17,26],[17,27,17,31],[13,4,13,10],[13,11,13,17],[13,18,13,24],[13,25,13,31],[14,4,14,10],[14,11,14,17],[14,18,14,24],[14,25,14,31],[8,4,8,7],[8,8,8,13],[8,14,8,19],[8,20,8,25],[8,26,8,31],[10,4,10,7],[11,20,11,25],[11,26,11,31],[9,4,9,7],[9,8,9,13],[9,14,9,19],[9,20,9,25],[9,26,9,31],[10,8,10,13],[10,14,10,19],[10,20,10,25],[10,26,10,31],[6,4,6,7],[6,8,6,13],[6,14,6,19],[6,20,6,25],[6,26,6,31],[7,4,7,7],[7,8,7,13],[7,14,7,19],[7,20,7,25],[7,26,7,31],[0,35,0,37],[0,38,0,40],[0,41,0,43],[1,0,1,1],[1,3,2,32],[3,4,3,31],[5,4,5,7],[5,8,5,13],[5,14,5,19],[5,20,5,25],[5,26,5,31]]}
[null,null,null,null,null,null,null,null,null,null,null,null,null,null,null,null,null,null,null,null,null,null,null,null,null,null,null,null,null,null,null,null,null,null,null,"بتنی",null,null,"فولادی",null,null,"select"]
["سیستم سازه",null,null,"محاسبه و تقسیم بار زلزله",null,null,null,null,null,null,null,null,null,null,null,null,null,null,null,null,null,null,null,null,null,null,null,null,null,null,null,null,null,null,null,{"$f":"'وزن سازه بتنی'!E2","v":"تیپ 1:پارکینگ"},{"$f":"'وزن سازه بتنی'!L33","v":174.25874999999999},{"$f":"'وزن سازه بتنی'!S33","v":34.25},{"$f":"'وزن سازه فولادی'!E2","v":"تیپ 1:زیرزمین"},{"$f":"'وزن سازه فولادی'!L32","v":135.14999999999998},{"$f":"'وزن سازه فولادی'!S32","v":34.25},{"$f":"IF($AL$6=1,AM2,AJ2)","v":"تیپ 1:پارکینگ"},174.25874999999999,34.25]
[null,null,null,null,null,null,null,null,null,null,null,null,null,null,null,null,null,null,null,null,null,null,null,null,null,null,null,null,null,null,null,null,null,null,null,{"$f":"'وزن سازه بتنی'!E36","v":"تیپ 2:مسکونی"},{"$f":"'وزن سازه بتنی'!L67","v":183.01874999999998},{"$f":"'وزن سازه بتنی'!S67","v":34.25},{"$f":"'وزن سازه فولادی'!E36","v":"تیپ 2:مسکونی"},{"$f":"'وزن سازه فولادی'!L66","v":149.65875},{"$f":"'وزن سازه فولادی'!S66","v":34.25},"تیپ 2:مسکونی",183.01874999999998,34.25]
[null,null,null,null,"جهت تعیین بار جانبی زلزله ابتدا باید وزن سازه و ضریب زازله را بدست آوریم:",null,null,null,null,null,null,null,null,null,null,null,null,null,null,null,null,null,null,null,null,null,null,null,null,null,null,null,null,null,null,{"$f":"'وزن سازه بتنی'!E70","v":"تیپ 3:بام"},{"$f":"'وزن سازه بتنی'!L101","v":184.77374999999998},{"$f":"'وزن سازه بتنی'!S101","v":27},{"$f":"'وزن سازه فولادی'!E70","v":"تیپ 3:بام"},{"$f":"'وزن سازه فولادی'!L100","v":154.33374999999998},{"$f":"'وزن سازه فولادی'!S100","v":27},"تیپ 3:بام",184.77374999999998,27]
[null,null,null,null,null,null,null,null,null,null,null,null,null,null,null,null,null,null,null,null,null,null,null,null,null,null,null,null,null,null,null,null,null,null,null,{"$f":"'وزن سازه بتنی'!E104","v":"تیپ 4:خرپشته"},{"$f":"'وزن سازه بتنی'!L135","v":28.925000000000004},{"$f":"'وزن سازه بتنی'!S135","v":2.25},{"$f":"'وزن سازه فولادی'!E104","v":"تیپ 4:خرپشته"},{"$f":"'وزن سازه فولادی'!L134","v":20.85},{"$f":"'وزن سازه فولادی'!S134","v":29},"تیپ 4:خرپشته",28.925000000000004,2.25]
[null,null,null,null,"شماره طبقه",null,null,null,"بار مرده",null,null,null,null,null,"بار زنده",null,null,null,null,null,"درصد مشارکت یار زنده",null,null,null,null,null,"مجموع بار مرده و زنده",null,null,null,null,null,null,null,null,null,null,2]
[null,null,null,null,"طبقه اول",null,null,null,{"$f":"CHOOSE(AJ7,$AQ$2,$AQ$3,$AQ$4,$AQ$5)","v":174.25874999999999},null,null,null,null,null,{"$f":"CHOOSE(AJ7,$AR$2,$AR$3,$AR$4,$AR$5)","v":34.25},null,null,null,null,null,0.2,null,null,null,null,null,{"$f":"I7+O7*U7","v":181.10874999999999},null,null,null,null,null,null,null,null,1]
[null,null,null,null,"طبقه دوم",null,null,null,{"$f":"CHOOSE(AJ8,$AQ$2,$AQ$3,$AQ$4,$AQ$5)","v":183.01874999999998},null,null,null,null,null,{"$f":"CHOOSE(AJ8,$AR$2,$AR$3,$AR$4,$AR$5)","v":34.25},null,null,null,null,null,0.2,null,null,null,null,null,{"$f":"I8+O8*U8","v":189.86874999999998},null,null,null,null,null,null,null,null,2]
[null,null,null,null,"طبقه سوم",null,null,null,{"$f":"CHOOSE(AJ9,$AQ$2,$AQ$3,$AQ$4,$AQ$5)","v":183.01874999999998},null,null,null,null,null,{"$f":"CHOOSE(AJ9,$AR$2,$AR$3,$AR$4,$AR$5)","v":34.25},null,null,null,null,null,0.2,null,null,null,null,null,189.86874999999998,null,null,null,null,null,null,null,null,2]
[null,null,null,null,"طبقه چهارم",null,null,null,{"$f":"CHOOSE(AJ10,$AQ$2,$AQ$3,$AQ$4,$AQ$5)","v":184.77374999999998},null,null,null,null,null,{"$f":"CHOOSE(AJ10,$AR$2,$AR$3,$AR$4,$AR$5)","v":27},null,null,null,null,null,0.2,null,null,null,null,null,190.17374999999998,null,null,null,null,null,null,null,null,3]
[null,null,null,null,"خرپشته",null,null,null,{"$f":"CHOOSE(AJ11,$AQ$2,$AQ$3,$AQ$4,$AQ$5)","v":28.925000000000004},null,null,null,null,null,{"$f":"CHOOSE(AJ11,$AR$2,$AR$3,$AR$4,$AR$5)","v":2.25},null,null,null,null,null,0.2,null,null,null,null,null,29.375000000000004,null,null,null,null,null,null,null,null,4]
[null,null,null,null,null,null,null,null,null,null,null,null,null,null,null,null,null,null,null,null,"مجموع وزن سازه",null,null,null,null,null,{"$f":"AA7+AA8+AA9+AA10+AA11","v":780.39499999999998}]
[]
[null,null,null,null,"ضریب زلزله در جهت X",null,null,null,null,null,null,null,null,null,null,null,null,null,"ضریب زلزله در جهت Y"]
[null,null,null,null,{"$f":"خلاصه!H29","v":0.11609999999999999},null,null,null,null,null,null,{"$f":"AA12*E15","v":90.603859499999999},null,null,null,null,null,null,{"$f":"خلاصه!D29","v":9.2700000000000005E-2},null,null,null,null,null,null,{"$f":"AA12*S15","v":72.342616500000005}]
[]
[null,null,null,null,"توزیع نیروی برشی در جهت X"]
[null,null,null,null,"شماره طبقه",null,null,null,"وزن طبقه",null,null,null,null,"ارتفاع طبقه",null,null,null,"ارتفاع از تراز پایه",null,null,null,null,"Wi×Hi",null,null,null,null,"Fi"]
[null,null,null,null,"طبقه اول",null,null,null,{"$f":"AA7","v":181.10874999999999},null,null,null,null,2.8,null,null,null,{"$f":"N19","v":2.8},null,null,null,null,{"$f":"I19*R19","v":507.10449999999992},null,null,null,null,{"$f":"$L$15*W19/$W$23","v":7.5403488920671453}]
[null,null,null,null,"طبقه دوم",null,null,null,{"$f":"AA8","v":189.86874999999998},null,null,null,null,3.5,null,null,null,{"$f":"R19+N20","v":6.3},null,null,null,null,{"$f":"I20*R20","v":1196.1731249999998},null,null,null,null,{"$f":"$L$15*W20/$W$23","v":17.786398459911606}]
[null,null,null,null,"طبقه سوم",null,null,null,{"$f":"AA9","v":189.86874999999998},null,null,null,null,3.5,null,null,null,{"$f":"R20+N21","v":9.8000000000000007},null,null,null,null,1860.7137499999999,null,null,null,null,{"$f":"$L$15*W21/$W$23","v":27.667730937640279}]
[null,null,null,null,"طبقه چهارم",null,null,null,{"$f":"AA10","v":190.17374999999998},null,null,null,null,3.5,null,null,null,13.3,null,null,null,null,2529.3108750000001,null,null,null,null,{"$f":"$L$15*W22/$W$23","v":37.609381210380967}]
[null,null,null,null,null,null,null,null,null,null,null,null,null,null,null,null,null,"ΣWi×Hi=",null,null,null,null,{"$f":"W19+W20+W21+W22","v":6093.3022499999997},null,null,null,null,{"$f":"AB19+AB20+AB21+AB22","v":90.603859499999999}]
[]
[null,null,null,null,"توزیع نیروی برشی در جهت Y"]
[null,null,null,null,"شماره طبقه",null,null,null,"وزن طبقه",null,null,null,null,"ارتفاع طبقه",null,null,null,"ارتفاع از تراز پایه",null,null,null,null,"Wi×Hi",null,null,null,null,"Fi"]
[null,null,null,null,"طبقه اول",null,null,null,{"$f":"AA7","v":181.10874999999999},null,null,null,null,{"$f":"N19","v":2.8},null,null,null,{"$f":"N27","v":2.8},null,null,null,null,{"$f":"I27*R27","v":507.10449999999992},null,null,null,null,{"$f":"$Z$15*W27/$W$31","v":6.0205886502551635}]
[null,null,null,null,"طبقه دوم",null,null,null,{"$f":"AA8","v":189.86874999999998},null,null,null,null,{"$f":"N20","v":3.5},null,null,null,{"$f":"R27+N28","v":6.3},null,null,null,null,{"$f":"I28*R28","v":1196.1731249999998},null,null,null,null,{"$f":"$Z$15*W28/$W$31","v":14.20154295636353}]
[null,null,null,null,"طبقه سوم",null,null,null,{"$f":"AA9","v":189.86874999999998},null,null,null,null,{"$f":"N21","v":3.5},null,null,null,{"$f":"R28+N29","v":9.8000000000000007},null,null,null,null,1860.7137499999999,null,null,null,null,{"$f":"$Z$15*W29/$W$31","v":22.091289043232162}]
[null,null,null,null,"طبقه چهارم",null,null,null,{"$f":"AA10","v":190.17374999999998},null,null,null,null,{"$f":"N22","v":3.5},null,null,null,13.3,null,null,null,null,2529.3108750000001,null,null,null,null,{"$f":"$Z$15*W30/$W$31","v":30.029195850149147}]
[null,null,null,null,null,null,null,null,null,null,null,null,null,null,null,null,null,"ΣWi×Hi=",null,null,null,null,{"$f":"W27+W28+W29+W30","v":6093.3022499999997},null,null,null,null,{"$f":"AB27+AB28+AB29+AB30","v":72.342616500000005}]
[]
[]
[null,null,null,null,"پخش نیروهای هر تراز بین قاب ها"]
[null,null,null,null,"در جهت X",null,null,null,null,null,null,null,null,null,null,null,null,null,"در جهت Y"]
[null,null,null,null,"سهم قاب مورد نظر از نیروی جانبی (درصد)",null,null,null,null,null,null,null,null,null,null,0.25,null,null,"سهم قاب مورد نظر از نیروی جانبی (درصد)",null,null,null,null,null,null,null,null,null,null,0.3]
[]
[null,null,null,null,"شماره طبقه",null,null,null,"نیرو در جهت X",null,null,null,null,null,"نیرو در جهت Y",null,null,null,null,null,"نیروی جانبی در جهت X",null,null,null,null,null,"نیروی جانبی در جهت Y"]
[null,null,null,null,"طبقه اول",null,null,null,{"$f":"AB19","v":7.5403488920671453},null,null,null,null,null,{"$f":"AB27","v":6.0205886502551635},null,null,null,null,null,{"$f":"I39*$P$36","v":1.8850872230167863},null,null,null,null,null,{"$f":"O39*$AD$36","v":1.8061765950765489}]
[null,null,null,null,"طبقه دوم",null,null,null,{"$f":"AB20","v":17.786398459911606},null,null,null,null,null,{"$f":"AB28","v":14.20154295636353},null,null,null,null,null,{"$f":"I40*$P$36","v":4.4465996149779015},null,null,null,null,null,{"$f":"O40*$AD$36","v":4.2604628869090586}]
[null,null,null,null,"طبقه سوم",null,null,null,27.667730937640279,null,null,null,null,null,22.091289043232162,null,null,null,null,null,{"$f":"I41*$P$36","v":6.9169327344100697},null,null,null,null,null,{"$f":"O41*$AD$36","v":6.6273867129696482}]
[null,null,null,null,"طبقه چهارم",null,null,null,37.609381210380967,null,null,null,null,null,30.029195850149147,null,null,null,null,null,{"$f":"I42*$P$36","v":9.4023453025952417},null,null,null,null,null,{"$f":"O42*$AD$36","v":9.0087587550447434}]
[]
[null,null,null,null,"محاسبه لنگر واژگونی در جهت X"]
[null,null,null,null,"شماره طبقه",null,null,null,"ارتفاع طبقه",null,null,null,null,null,"ارتفاع از تراز پابه",null,null,null,null,null,"Fi",null,null,null,null,null,"Fi × Hi"]
[null,null,null,null,"طبقه اول",null,null,null,{"$f":"N19","v":2.8},null,null,null,null,null,{"$f":"I46","v":2.8},null,null,null,null,null,{"$f":"AB19","v":7.5403488920671453},null,null,null,null,null,{"$f":"O46*U46","v":21.112976897788005}]
[null,null,null,null,"طبقه دوم",null,null,null,{"$f":"N20","v":3.5},null,null,null,null,null,{"$f":"O46+I47","v":6.3},null,null,null,null,null,{"$f":"AB20","v":17.786398459911606},null,null,null,null,null,{"$f":"O47*U47","v":112.05431029744311}]
[null,null,null,null,"طبقه سوم",null,null,null,{"$f":"N21","v":3.5},null,null,null,null,null,{"$f":"O47+I48","v":9.8000000000000007},null,null,null,null,null,27.667730937640279,null,null,null,null,null,271.14376318887474]
[null,null,null,null,"طبقه چهارم",null,null,null,{"$f":"N22","v":3.5},null,null,null,null,null,13.3,null,null,null,null,null,37.609381210380967,null,null,null,null,null,500.20477009806689]
[null,null,null,null,null,null,null,null,null,null,null,null,null,null,null,null,null,null,null,null,"Σ=",null,null,null,null,null,{"$f":"AA46+AA47+AA48+AA49","v":904.51582048217278}]
[]
[null,null,null,null,"محاسبه لنگر مقاوم در جهت X",null,null,null,null,null,null,null,"وزن سازه",null,null,null,null,"مرکز سطح  X",null,null,null,null,"Mrx",null,null,null,null,{"$f":"IF(W53/AA50>1.75,\"OK\",\"N.OK\")","v":"OK"}]
[null,null,null,null,null,null,null,null,null,null,null,null,{"$f":"AA12","v":780.39499999999998},null,null,null,null,4.2,null,null,null,null,{"$f":"M53*R53","v":3277.6590000000001}]
[]
[null,null,null,null,"محاسبه لنگر واژگونی در جهت Y"]
[null,null,null,null,"شماره طبقه",null,null,null,"ارتفاع طبقه",null,null,null,null,null,"ارتفاع از تراز پابه",null,null,null,null,null,"Fi",null,null,null,null,null,"Fi × Hi"]
[null,null,null,null,"طبقه اول",null,null,null,{"$f":"N19","v":2.8},null,null,null,null,null,{"$f":"I57","v":2.8},null,null,null,null,null,{"$f":"AB27","v":6.0205886502551635},null,null,null,null,null,{"$f":"O57*U57","v":16.857648220714456}]
[null,null,null,null,"طبقه دوم",null,null,null,{"$f":"N20","v":3.5},null,null,null,null,null,{"$f":"O57+I58","v":6.3},null,null,null,null,null,{"$f":"AB28","v":14.20154295636353},null,null,null,null,null,{"$f":"O58*U58","v":89.469720625090233}]
[null,null,null,null,"طبقه سوم",null,null,null,{"$f":"N21","v":3.5},null,null,null,null,null,{"$f":"O58+I59","v":9.8000000000000007},null,null,null,null,null,22.091289043232162,null,null,null,null,null,216.49463262367522]
[null,null,null,null,"طبقه چهارم",null,null,null,{"$f":"N22","v":3.5},null,null,null,null,null,13.3,null,null,null,null,null,30.029195850149147,null,null,null,null,null,399.38830480698368]
[null,null,null,null,null,null,null,null,null,null,null,null,null,null,null,null,null,null,null,null,"Σ=",null,null,null,null,null,{"$f":"AA57+AA58+AA59+AA60","v":722.2103062764636}]
[]
[null,null,null,null,"محاسبه لنگر مقاوم در جهت Y",null,null,null,null,null,null,null,"وزن سازه",null,null,null,null,"مرکز سطح  Y",null,null,null,null,"Mry",null,null,null,null,{"$f":"IF(W64/AA61>1.75,\"OK\",\"N.OK\")","v":"OK"}]
[null,null,null,null,null,null,null,null,null,null,null,null,{"$f":"AA12","v":780.39499999999998},null,null,null,null,7.2,null,null,null,null,{"$f":"M64*R64","v":5618.8440000000001}]
[]
[]
[]
[null,null,null,null,null,null,{"$f":"U42","v":9.4023453025952417},null,null,null,null,"4 st"]
[]
[]
[]
[null,null,null,null,null,null,{"$f":"U41","v":6.9169327344100697},null,null,null,null,"3 st"]
[]
[]
[]
[null,null,null,null,null,null,{"$f":"U40","v":4.4465996149779015},null,null,null,null,"2 st"]
[]
[]
[]
[null,null,null,null,null,null,{"$f":"U39","v":1.8850872230167863},null,null,null,null,"1 st"]
[]
[]
[]
[null,null,null,null,null,null,{"$f":"AA42","v":9.0087587550447434},null,null,null,null,"4 st"]
[]
[]
[]
[null,null,null,null,null,null,{"$f":"AA41","v":6.6273867129696482},null,null,null,null,"3 st"]
[]
[]
[]
[null,null,null,null,null,null,{"$f":"AA40","v":4.2604628869090586},null,null,null,null,"2 st"]
[]
[]
[]
[null,null,null,null,null,null,{"$f":"AA39","v":1.8061765950765489},null,null,null,null,"1 st"]

{"sheet":"5 طبقه","index":27,"n_rows":102,"n_cols":44,"rows_kept":102,"cut":false,"hidden":false,"merged":[[93,11,94,24],[95,11,95,24],[96,11,97,24],[98,11,98,24],[84,11,84,24],[85,11,86,24],[75,6,76,8],[78,6,79,8],[81,6,82,8],[84,6,85,8],[89,11,89,24],[90,11,91,24],[92,11,92,24],[99,11,100,24],[101,11,101,24],[67,4,68,11],[67,12,67,16],[67,17,67,21],[67,22,67,26],[67,27,68,31],[68,12,68,16],[68,17,68,21],[68,22,68,26],[72,11,72,24],[72,6,73,8],[73,11,74,24],[101,6,102,8],[98,6,99,8],[95,6,96,8],[92,6,93,8],[89,6,90,8],[75,11,75,24],[76,11,77,24],[78,11,78,24],[79,11,80,24],[81,11,81,24],[82,11,83,24],[60,4,60,7],[60,8,60,13],[60,14,60,19],[60,20,60,25],[60,26,60,31],[61,4,61,7],[61,8,61,13],[61,14,61,19],[61,20,61,25],[61,26,61,31],[65,20,65,25],[65,26,65,31],[62,4,62,7],[62,8,62,13],[62,14,62,19],[62,20,62,25],[62,26,62,31],[63,4,63,7],[63,8,63,13],[63,14,63,19],[63,20,63,25],[63,26,63,31],[64,20,64,25],[64,26,64,31],[64,4,64,7],[64,8,64,13],[64,14,64,19],[59,4,59,7],[59,8,59,13],[59,14,59,19],[59,20,59,25],[59,26,59,31],[51,14,51,19],[51,20,51,25],[51,26,51,31],[52,8,52,13],[52,14,52,19],[52,20,52,25],[52,26,52,31],[53,20,53,25],[53,26,53,31],[55,12,55,16],[55,17,55,21],[55,22,55,26],[56,12,56,16],[56,17,56,21],[56,22,56,26],[55,27,56,31],[55,4,56,11],[58,4,58,31],[46,4,46,31],[47,4,47,7],[48,4,48,7],[49,4,49,7],[50,4,50,7],[51,4,51,7],[52,4,52,7],[47,8,47,13],[47,14,47,19],[47,20,47,25],[47,26,47,31],[48,8,48,13],[48,14,48,19],[48,20,48,25],[48,26,48,31],[49,8,49,13],[49,14,49,19],[49,20,49,25],[49,26,49,31],[50,8,50,13],[50,14,50,19],[50,20,50,25],[50,26,50,31],[51,8,51,13],[42,20,42,25],[42,26,42,31],[43,8,43,13],[43,14,43,19],[43,20,43,25],[43,26,43,31],[44,8,44,13],[44,14,44,19],[44,20,44,25],[44,26,44,31],[39,20,39,25],[39,26,39,31],[40,8,40,13],[40,14,40,19],[40,20,40,25],[40,26,40,31],[41,8,41,13],[41,14,41,19],[41,20,41,25],[41,26,41,31],[39,4,39,7],[40,4,40,7],[41,4,41,7],[42,4,42,7],[43,4,43,7],[44,4,44,7],[45,4,45,7],[39,8,39,13],[39,14,39,19],[42,8,42,13],[42,14,42,19],[35,4,35,31],[36,4,36,17],[36,18,36,31],[37,4,37,14],[37,15,37,17],[37,18,37,28],[37,29,37,31],[17,27,17,31],[16,4,16,31],[17,4,17,7],[17,8,17,12],[17,13,17,16],[17,17,17,21],[17,22,17,26],[23,4,23,7],[23,17,23,21],[23,22,23,26],[23,27,23,31],[22,4,22,7],[22,8,22,12],[22,13,22,16],[22,17,22,21],[22,22,22,26],[22,27,22,31],[20,27,20,31],[21,4,21,7],[21,8,21,12],[21,13,21,16],[21,17,21,21],[21,22,21,26],[21,27,21,31],[19,8,19,12],[19,13,19,16],[19,17,19,21],[19,22,19,26],[19,27,19,31],[20,4,20,7],[20,8,20,12],[20,13,20,16],[20,17,20,21],[20,22,20,26],[32,4,32,7],[25,4,25,31],[18,4,18,7],[18,8,18,12],[18,13,18,16],[18,17,18,21],[18,22,18,26],[18,27,18,31],[19,4,19,7],[30,4,30,7],[30,8,30,12],[30,13,30,16],[30,17,30,21],[30,22,30,26],[30,27,30,31],[29,4,29,7],[29,8,29,12],[29,13,29,16],[29,17,29,21],[29,22,29,26],[29,27,29,31],[28,4,28,7],[28,8,28,12],[28,13,28,16],[31,22,31,26],[31,27,31,31],[32,17,32,21],[32,22,32,26],[32,27,32,31],[26,4,26,7],[26,8,26,12],[26,13,26,16],[26,17,26,21],[26,22,26,26],[31,4,31,7],[31,8,31,12],[31,13,31,16],[31,17,31,21],[28,17,28,21],[28,22,28,26],[28,27,28,31],[26,27,26,31],[27,4,27,7],[27,8,27,12],[27,13,27,16],[27,17,27,21],[27,22,27,26],[27,27,27,31],[13,4,13,10],[13,11,13,17],[13,18,13,24],[13,25,13,31],[14,4,14,10],[14,11,14,17],[14,18,14,24],[14,25,14,31],[11,4,11,7],[11,8,11,13],[11,14,11,19],[11,26,11,31],[11,20,11,25],[9,4,9,7],[9,8,9,13],[9,14,9,19],[9,20,9,25],[9,26,9,31],[10,4,10,7],[10,8,10,13],[10,14,10,19],[10,20,10,25],[10,26,10,31],[7,4,7,7],[7,8,7,13],[7,14,7,19],[7,20,7,25],[7,26,7,31],[8,4,8,7],[8,8,8,13],[8,14,8,19],[8,20,8,25],[8,26,8,31],[5,4,5,7],[5,8,5,13],[5,14,5,19],[5,20,5,25],[5,26,5,31],[6,4,6,7],[6,8,6,13],[6,14,6,19],[6,20,6,25],[6,26,6,31],[1,0,1,1],[0,35,0,37],[0,38,0,40],[0,41,0,43],[3,4,3,31],[1,3,2,32],[4,4,4,7],[4,8,4,13],[4,14,4,19],[4,20,4,25],[4,26,4,31]]}
[null,null,null,null,null,null,null,null,null,null,null,null,null,null,null,null,null,null,null,null,null,null,null,null,null,null,null,null,null,null,null,null,null,null,null,"بتنی",null,null,"فولادی",null,null,"select"]
["سیستم سازه",null,null,"محاسبه و تقسیم بار زلزله",null,null,null,null,null,null,null,null,null,null,null,null,null,null,null,null,null,null,null,null,null,null,null,null,null,null,null,null,null,null,null,{"$f":"'وزن سازه بتنی'!E2","v":"تیپ 1:پارکینگ"},{"$f":"'وزن سازه بتنی'!L33","v":174.25874999999999},{"$f":"'وزن سازه بتنی'!S33","v":34.25},{"$f":"'وزن سازه فولادی'!E2","v":"تیپ 1:زیرزمین"},{"$f":"'وزن سازه فولادی'!L32","v":135.14999999999998},{"$f":"'وزن سازه فولادی'!S32","v":34.25},{"$f":"IF($AL$6=1,AM2,AJ2)","v":"تیپ 1:پارکینگ"},174.25874999999999,34.25]
[null,null,null,null,null,null,null,null,null,null,null,null,null,null,null,null,null,null,null,null,null,null,null,null,null,null,null,null,null,null,null,null,null,null,null,{"$f":"'وزن سازه بتنی'!E36","v":"تیپ 2:مسکونی"},{"$f":"'وزن سازه بتنی'!L67","v":183.01874999999998},{"$f":"'وزن سازه بتنی'!S67","v":34.25},{"$f":"'وزن سازه فولادی'!E36","v":"تیپ 2:مسکونی"},{"$f":"'وزن سازه فولادی'!L66","v":149.65875},{"$f":"'وزن سازه فولادی'!S66","v":34.25},"تیپ 2:مسکونی",183.01874999999998,34.25]
[null,null,null,null,"جهت تعیین بار جانبی زلزله ابتدا باید وزن سازه و ضریب زازله را بدست آوریم:",null,null,null,null,null,null,null,null,null,null,null,null,null,null,null,null,null,null,null,null,null,null,null,null,null,null,null,null,null,null,{"$f":"'وزن سازه بتنی'!E70","v":"تیپ 3:بام"},{"$f":"'وزن سازه بتنی'!L101","v":184.77374999999998},{"$f":"'وزن سازه بتنی'!S101","v":27},{"$f":"'وزن سازه فولادی'!E70","v":"تیپ 3:بام"},{"$f":"'وزن سازه فولادی'!L100","v":154.33374999999998},{"$f":"'وزن سازه فولادی'!S100","v":27},"تیپ 3:بام",184.77374999999998,27]
[null,null,null,null,"شماره طبقه",null,null,null,"بار مرده",null,null,null,null,null,"بار زنده",null,null,null,null,null,"درصد مشارکت یار زنده",null,null,null,null,null,"مجموع بار مرده و زنده",null,null,null,null,null,null,null,null,{"$f":"'وزن سازه بتنی'!E104","v":"تیپ 4:خرپشته"},{"$f":"'وزن سازه بتنی'!L135","v":28.925000000000004},{"$f":"'وزن سازه بتنی'!S135","v":2.25},{"$f":"'وزن سازه فولادی'!E104","v":"تیپ 4:خرپشته"},{"$f":"'وزن سازه فولادی'!L134","v":20.85},{"$f":"'وزن سازه فولادی'!S134","v":29},"تیپ 4:خرپشته",28.925000000000004,2.25]
[null,null,null,null,"طبقه اول",null,null,null,{"$f":"CHOOSE(AJ6,$AQ$2,$AQ$3,$AQ$4,$AQ$5)","v":174.25874999999999},null,null,null,null,null,{"$f":"CHOOSE(AJ6,$AR$2,$AR$3,$AR$4,$AR$5)","v":34.25},null,null,null,null,null,0.2,null,null,null,null,null,{"$f":"I6+O6*U6","v":181.10874999999999},null,null,null,null,null,null,null,null,1,null,2]
[null,null,null,null,"طبقه دوم",null,null,null,183.01874999999998,null,null,null,null,null,34.25,null,null,null,null,null,0.2,null,null,null,null,null,{"$f":"I7+O7*U7","v":189.86874999999998},null,null,null,null,null,null,null,null,2]
[null,null,null,null,"طبقه سوم",null,null,null,183.01874999999998,null,null,null,null,null,34.25,null,null,null,null,null,0.2,null,null,null,null,null,189.86874999999998,null,null,null,null,null,null,null,null,2]
[null,null,null,null,"طبقه چهارم",null,null,null,183.01874999999998,null,null,null,null,null,34.25,null,null,null,null,null,0.2,null,null,null,null,null,189.86874999999998,null,null,null,null,null,null,null,null,2]
[null,null,null,null,"طبقه پنجم",null,null,null,184.77374999999998,null,null,null,null,null,27,null,null,null,null,null,0.2,null,null,null,null,null,190.17374999999998,null,null,null,null,null,null,null,null,3]
[null,null,null,null,"خرپشته",null,null,null,28.925000000000004,null,null,null,null,null,2.25,null,null,null,null,null,0.2,null,null,null,null,null,29.375000000000004,null,null,null,null,null,null,null,null,4]
[null,null,null,null,null,null,null,null,null,null,null,null,null,null,null,null,null,null,null,null,"مجموع وزن سازه",null,null,null,null,null,{"$f":"AA6+AA7+AA8+AA9+AA10+AA11","v":970.26374999999985}]
[]
[null,null,null,null,"ضریب زلزله در جهت X",null,null,null,null,null,null,null,null,null,null,null,null,null,"ضریب زلزله در جهت Y"]
[null,null,null,null,{"$f":"خلاصه!H29","v":0.11609999999999999},null,null,null,null,null,null,{"$f":"AA12*E15","v":112.64762137499997},null,null,null,null,null,null,{"$f":"خلاصه!D29","v":9.2700000000000005E-2},null,null,null,null,null,null,{"$f":"AA12*S15","v":89.943449624999985}]
[]
[null,null,null,null,"توزیع نیروی برشی در جهت X"]
[null,null,null,null,"شماره طبقه",null,null,null,"وزن طبقه",null,null,null,null,"ارتفاع طبقه",null,null,null,"ارتفاع از تراز پایه",null,null,null,null,"Wi×Hi",null,null,null,null,"Fi"]
[null,null,null,null,"طبقه اول",null,null,null,{"$f":"AA6","v":181.10874999999999},null,null,null,null,2.8,null,null,null,{"$f":"N19","v":2.8},null,null,null,null,{"$f":"I19*R19","v":507.10449999999992},null,null,null,null,{"$f":"$L$15*W19/$W$24","v":6.152854591853151}]
[null,null,null,null,"طبقه دوم",null,null,null,{"$f":"AA7","v":189.86874999999998},null,null,null,null,3.5,null,null,null,{"$f":"R19+N20","v":6.3},null,null,null,null,{"$f":"I20*R20","v":1196.1731249999998},null,null,null,null,{"$f":"$L$15*W20/$W$24","v":14.513535779721112}]
[null,null,null,null,"طبقه سوم",null,null,null,189.86874999999998,null,null,null,null,3.5,null,null,null,{"$f":"R20+N21","v":9.8000000000000007},null,null,null,null,1860.7137499999999,null,null,null,null,22.576611212899504]
[null,null,null,null,"طبقه چهارم",null,null,null,189.86874999999998,null,null,null,null,3.5,null,null,null,13.3,null,null,null,null,2525.254375,null,null,null,null,30.639686646077905]
[null,null,null,null,"طبقه پنجم",null,null,null,190.17374999999998,null,null,null,null,3.5,null,null,null,16.8,null,null,null,null,3194.9189999999999,null,null,null,null,38.764933144448293]
[null,null,null,null,null,null,null,null,null,null,null,null,null,null,null,null,null,"ΣWi×Hi=",null,null,null,null,{"$f":"W19+W20+W21+W22+W23","v":9284.1647499999999},null,null,null,null,{"$f":"AB19+AB20+AB21+AB22+AB23","v":112.64762137499997}]
[]
[null,null,null,null,"توزیع نیروی برشی در جهت Y"]
[null,null,null,null,"شماره طبقه",null,null,null,"وزن طبقه",null,null,null,null,"ارتفاع طبقه",null,null,null,"ارتفاع از تراز پایه",null,null,null,null,"Wi×Hi",null,null,null,null,"Fi"]
[null,null,null,null,"طبقه اول",null,null,null,{"$f":"AA6","v":181.10874999999999},null,null,null,null,{"$f":"N19","v":2.8},null,null,null,{"$f":"N28","v":2.8},null,null,null,null,{"$f":"I28*R28","v":507.10449999999992},null,null,null,null,{"$f":"$Z$15*W28/$W$33","v":4.9127443640377884}]
[null,null,null,null,"طبقه دوم",null,null,null,{"$f":"AA7","v":189.86874999999998},null,null,null,null,{"$f":"N20","v":3.5},null,null,null,{"$f":"R28+N29","v":6.3},null,null,null,null,{"$f":"I29*R29","v":1196.1731249999998},null,null,null,null,{"$f":"$Z$15*W29/$W$33","v":11.588327017916857}]
[null,null,null,null,"طبقه سوم",null,null,null,189.86874999999998,null,null,null,null,3.5,null,null,null,{"$f":"R29+N30","v":9.8000000000000007},null,null,null,null,1860.7137499999999,null,null,null,null,18.02628647231511]
[null,null,null,null,"طبقه چهارم",null,null,null,189.86874999999998,null,null,null,null,3.5,null,null,null,13.3,null,null,null,null,2525.254375,null,null,null,null,24.464245926713367]
[null,null,null,null,"طبقه پنجم",null,null,null,190.17374999999998,null,null,null,null,3.5,null,null,null,16.8,null,null,null,null,3194.9189999999999,null,null,null,null,30.951845844016862]
[null,null,null,null,null,null,null,null,null,null,null,null,null,null,null,null,null,"ΣWi×Hi=",null,null,null,null,{"$f":"W28+W29+W30+W31+W32","v":9284.1647499999999},null,null,null,null,{"$f":"AB28+AB29+AB30+AB31+AB32","v":89.943449624999985}]
[]
[]
[null,null,null,null,"پخش نیروهای هر تراز بین قاب ها"]
[null,null,null,null,"در جهت X",null,null,null,null,null,null,null,null,null,null,null,null,null,"در جهت Y"]
[null,null,null,null,"سهم قاب مورد نظر از نیروی جانبی (درصد)",null,null,null,null,null,null,null,null,null,null,0.25,null,null,"سهم قاب مورد نظر از نیروی جانبی (درصد)",null,null,null,null,null,null,null,null,null,null,0.3]
[]
[null,null,null,null,"شماره طبقه",null,null,null,"نیرو در جهت X",null,null,null,null,null,"نیرو در جهت Y",null,null,null,null,null,"نیروی جانبی در جهت X",null,null,null,null,null,"نیروی جانبی در جهت Y"]
[null,null,null,null,"طبقه اول",null,null,null,{"$f":"AB19","v":6.152854591853151},null,null,null,null,null,{"$f":"AB28","v":4.9127443640377884},null,null,null,null,null,{"$f":"I41*$P$38","v":1.5382136479632877},null,null,null,null,null,{"$f":"O41*$AD$38","v":1.4738233092113364}]
[null,null,null,null,"طبقه دوم",null,null,null,{"$f":"AB20","v":14.513535779721112},null,null,null,null,null,{"$f":"AB29","v":11.588327017916857},null,null,null,null,null,{"$f":"I42*$P$38","v":3.6283839449302779},null,null,null,null,null,{"$f":"O42*$AD$38","v":3.476498105375057}]
[null,null,null,null,"طبقه سوم",null,null,null,22.576611212899504,null,null,null,null,null,18.02628647231511,null,null,null,null,null,5.644152803224876,null,null,null,null,null,5.4078859416945333]
[null,null,null,null,"طبقه چهارم",null,null,null,30.639686646077905,null,null,null,null,null,24.464245926713367,null,null,null,null,null,7.6599216615194763,null,null,null,null,null,7.33927377801401]
[null,null,null,null,"طبقه پنجم",null,null,null,38.764933144448293,null,null,null,null,null,30.951845844016862,null,null,null,null,null,9.6912332861120731,null,null,null,null,null,9.2855537532050576]
[]
[null,null,null,null,"محاسبه لنگر واژگونی در جهت X"]
[null,null,null,null,"شماره طبقه",null,null,null,"ارتفاع طبقه",null,null,null,null,null,"ارتفاع از تراز پابه",null,null,null,null,null,"Fi",null,null,null,null,null,"Fi × Hi"]
[null,null,null,null,"طبقه اول",null,null,null,{"$f":"N19","v":2.8},null,null,null,null,null,{"$f":"I49","v":2.8},null,null,null,null,null,{"$f":"AB19","v":6.152854591853151},null,null,null,null,null,{"$f":"O49*U49","v":17.22799285718882}]
[null,null,null,null,"طبقه دوم",null,null,null,{"$f":"N20","v":3.5},null,null,null,null,null,{"$f":"O49+I50","v":6.3},null,null,null,null,null,{"$f":"AB20","v":14.513535779721112},null,null,null,null,null,{"$f":"O50*U50","v":91.435275412243001}]
[null,null,null,null,"طبقه سوم",null,null,null,3.5,null,null,null,null,null,{"$f":"O50+I51","v":9.8000000000000007},null,null,null,null,null,22.576611212899504,null,null,null,null,null,221.25078988641516]
[null,null,null,null,"طبقه چهارم",null,null,null,3.5,null,null,null,null,null,13.3,null,null,null,null,null,30.639686646077905,null,null,null,null,null,407.50783239283618]
[null,null,null,null,"طبقه پنجم",null,null,null,3.5,null,null,null,null,null,16.8,null,null,null,null,null,38.764933144448293,null,null,null,null,null,651.25087682673131]
[null,null,null,null,null,null,null,null,null,null,null,null,null,null,null,null,null,null,null,null,"Σ=",null,null,null,null,null,{"$f":"AA49+AA50+AA51+AA52+AA53","v":1388.6727673754144}]
[]
[null,null,null,null,"محاسبه لنگر مقاوم در جهت X",null,null,null,null,null,null,null,"وزن سازه",null,null,null,null,"مرکز سطح  X",null,null,null,null,"Mrx",null,null,null,null,{"$f":"IF(W57/AA54>1.75,\"OK\",\"N.OK\")","v":"OK"}]
[null,null,null,null,null,null,null,null,null,null,null,null,{"$f":"AA12","v":970.26374999999985},null,null,null,null,4.2,null,null,null,null,{"$f":"M57*R57","v":4075.1077499999997}]
[]
[null,null,null,null,"محاسبه لنگر واژگونی در جهت Y"]
[null,null,null,null,"شماره طبقه",null,null,null,"ارتفاع طبقه",null,null,null,null,null,"ارتفاع از تراز پابه",null,null,null,null,null,"Fi",null,null,null,null,null,"Fi × Hi"]
[null,null,null,null,"طبقه اول",null,null,null,{"$f":"N19","v":2.8},null,null,null,null,null,{"$f":"I61","v":2.8},null,null,null,null,null,{"$f":"AB28","v":4.9127443640377884},null,null,null,null,null,{"$f":"O61*U61","v":13.755684219305806}]
[null,null,null,null,"طبقه دوم",null,null,null,{"$f":"N20","v":3.5},null,null,null,null,null,{"$f":"O61+I62","v":6.3},null,null,null,null,null,{"$f":"AB29","v":11.588327017916857},null,null,null,null,null,{"$f":"O62*U62","v":73.006460212876192}]
[null,null,null,null,"طبقه سوم",null,null,null,3.5,null,null,null,null,null,{"$f":"O62+I63","v":9.8000000000000007},null,null,null,null,null,18.02628647231511,null,null,null,null,null,176.6576074286881]
[null,null,null,null,"طبقه چهارم",null,null,null,3.5,null,null,null,null,null,13.3,null,null,null,null,null,24.464245926713367,null,null,null,null,null,325.3744708252878]
[null,null,null,null,"طبقه پنجم",null,null,null,3.5,null,null,null,null,null,16.8,null,null,null,null,null,30.951845844016862,null,null,null,null,null,519.99101017948328]
[null,null,null,null,null,null,null,null,null,null,null,null,null,null,null,null,null,null,null,null,"Σ=",null,null,null,null,null,{"$f":"AA61+AA62+AA63+AA64+AA65","v":1108.7852328656411}]
[]
[null,null,null,null,"محاسبه لنگر مقاوم در جهت Y",null,null,null,null,null,null,null,"وزن سازه",null,null,null,null,"مرکز سطح  Y",null,null,null,null,"Mry",null,null,null,null,{"$f":"IF(W69/AA66>1.75,\"OK\",\"N.OK\")","v":"OK"}]
[null,null,null,null,null,null,null,null,null,null,null,null,{"$f":"AA12","v":970.26374999999985},null,null,null,null,7.2,null,null,null,null,{"$f":"M69*R69","v":6985.8989999999994}]
[]
[]
[]
[null,null,null,null,null,null,{"$f":"U45","v":9.6912332861120731}]
[]
[]
[null,null,null,null,null,null,{"$f":"U44","v":7.6599216615194763}]
[]
[]
[null,null,null,null,null,null,{"$f":"U43","v":5.644152803224876}]
[]
[]
[null,null,null,null,null,null,{"$f":"U42","v":3.6283839449302779}]
[]
[]
[null,null,null,null,null,null,{"$f":"U41","v":1.5382136479632877}]
[]
[]
[]
[]
[null,null,null,null,null,null,{"$f":"AA45","v":9.2855537532050576}]
[]
[]
[null,null,null,null,null,null,{"$f":"AA44","v":7.33927377801401}]
[]
[]
[null,null,null,null,null,null,{"$f":"AA43","v":5.4078859416945333}]
[]
[]
[null,null,null,null,null,null,{"$f":"AA42","v":3.476498105375057}]
[]
[]
[null,null,null,null,null,null,{"$f":"AA41","v":1.4738233092113364}]

{"sheet":"6 طبقه","index":28,"n_rows":129,"n_cols":41,"rows_kept":129,"cut":false,"hidden":false,"merged":[[5,38,5,40],[6,4,6,7],[6,8,6,13],[6,14,6,19],[6,20,6,25],[6,26,6,31],[0,0,0,1],[0,35,0,37],[0,38,0,40],[1,0,1,1],[1,3,2,32],[4,4,4,31],[7,4,7,7],[7,8,7,13],[7,14,7,19],[7,20,7,25],[7,26,7,31],[8,4,8,7],[8,8,8,13],[8,14,8,19],[8,20,8,25],[8,26,8,31],[9,4,9,7],[9,8,9,13],[9,14,9,19],[9,20,9,25],[9,26,9,31],[10,4,10,7],[10,8,10,13],[10,14,10,19],[10,20,10,25],[10,26,10,31],[14,20,14,25],[14,26,14,31],[13,4,13,7],[13,8,13,13],[13,14,13,19],[13,20,13,25],[13,26,13,31],[11,4,11,7],[11,8,11,13],[11,14,11,19],[11,20,11,25],[11,26,11,31],[12,4,12,7],[12,8,12,13],[12,14,12,19],[12,20,12,25],[12,26,12,31],[19,4,19,31],[20,4,20,7],[20,8,20,12],[20,13,20,16],[20,17,20,21],[20,22,20,26],[20,27,20,31],[16,4,16,10],[16,11,16,17],[16,18,16,24],[16,25,16,31],[17,4,17,10],[17,11,17,17],[17,18,17,24],[17,25,17,31],[22,4,22,7],[22,8,22,12],[22,13,22,16],[22,17,22,21],[22,22,22,26],[22,27,22,31],[21,4,21,7],[21,8,21,12],[21,13,21,16],[21,17,21,21],[21,22,21,26],[21,27,21,31],[24,4,24,7],[24,8,24,12],[24,13,24,16],[24,17,24,21],[24,22,24,26],[24,27,24,31],[23,4,23,7],[23,8,23,12],[23,13,23,16],[23,17,23,21],[23,22,23,26],[23,27,23,31],[26,4,26,7],[26,8,26,12],[26,13,26,16],[26,17,26,21],[26,22,26,26],[26,27,26,31],[25,4,25,7],[25,8,25,12],[25,13,25,16],[25,17,25,21],[25,22,25,26],[25,27,25,31],[31,4,31,7],[31,8,31,12],[31,13,31,16],[31,17,31,21],[31,22,31,26],[31,27,31,31],[27,17,27,21],[27,22,27,26],[27,27,27,31],[29,4,29,31],[30,4,30,7],[30,8,30,12],[30,13,30,16],[30,17,30,21],[30,22,30,26],[30,27,30,31],[33,4,33,7],[33,8,33,12],[33,13,33,16],[33,17,33,21],[33,22,33,26],[33,27,33,31],[32,4,32,7],[32,8,32,12],[32,13,32,16],[32,17,32,21],[32,22,32,26],[32,27,32,31],[35,4,35,7],[35,8,35,12],[35,13,35,16],[35,17,35,21],[35,22,35,26],[35,27,35,31],[34,4,34,7],[34,8,34,12],[34,13,34,16],[34,17,34,21],[34,22,34,26],[34,27,34,31],[37,17,37,21],[37,22,37,26],[37,27,37,31],[42,4,42,31],[43,4,43,17],[43,18,43,31],[36,4,36,7],[36,8,36,12],[36,13,36,16],[36,17,36,21],[36,22,36,26],[36,27,36,31],[44,4,44,14],[44,15,44,17],[44,18,44,28],[44,29,44,31],[46,4,46,7],[46,8,46,13],[46,14,46,19],[46,20,46,25],[46,26,46,31],[47,4,47,7],[47,8,47,13],[47,14,47,19],[47,20,47,25],[47,26,47,31],[48,4,48,7],[48,8,48,13],[48,14,48,19],[48,20,48,25],[48,26,48,31],[49,4,49,7],[49,8,49,13],[49,14,49,19],[49,20,49,25],[49,26,49,31],[50,4,50,7],[50,8,50,13],[50,14,50,19],[50,20,50,25],[50,26,50,31],[54,4,54,31],[55,4,55,7],[55,8,55,13],[55,14,55,19],[55,20,55,25],[55,26,55,31],[51,4,51,7],[51,8,51,13],[51,14,51,19],[51,20,51,25],[51,26,51,31],[52,4,52,7],[52,8,52,13],[52,14,52,19],[52,20,52,25],[52,26,52,31],[56,4,56,7],[56,8,56,13],[56,14,56,19],[56,20,56,25],[56,26,56,31],[57,4,57,7],[57,8,57,13],[57,14,57,19],[57,20,57,25],[57,26,57,31],[58,4,58,7],[58,8,58,13],[58,14,58,19],[58,20,58,25],[58,26,58,31],[59,4,59,7],[59,8,59,13],[59,14,59,19],[59,20,59,25],[59,26,59,31],[60,4,60,7],[60,8,60,13],[60,14,60,19],[60,20,60,25],[60,26,60,31],[61,4,61,7],[61,8,61,13],[61,14,61,19],[61,20,61,25],[61,26,61,31],[67,4,67,31],[68,4,68,7],[68,8,68,13],[68,14,68,19],[68,20,68,25],[68,26,68,31],[62,20,62,25],[62,26,62,31],[64,4,65,11],[64,12,64,16],[64,17,64,21],[64,22,64,26],[64,27,65,31],[65,12,65,16],[65,17,65,21],[65,22,65,26],[69,4,69,7],[69,8,69,13],[69,14,69,19],[69,20,69,25],[69,26,69,31],[70,4,70,7],[70,8,70,13],[70,14,70,19],[70,20,70,25],[70,26,70,31],[71,4,71,7],[71,8,71,13],[71,14,71,19],[71,20,71,25],[71,26,71,31],[72,4,72,7],[72,8,72,13],[72,14,72,19],[72,20,72,25],[72,26,72,31],[73,4,73,7],[73,8,73,13],[73,14,73,19],[73,20,73,25],[73,26,73,31],[74,4,74,7],[74,8,74,13],[74,14,74,19],[74,20,74,25],[74,26,74,31],[75,20,75,25],[75,26,75,31],[77,4,78,11],[77,12,77,16],[77,17,77,21],[77,22,77,26],[77,27,78,31],[78,12,78,16],[78,17,78,21],[78,22,78,26],[91,6,92,8],[91,11,91,24],[92,11,94,24],[95,6,96,8],[95,11,95,24],[96,11,98,24],[83,6,84,8],[83,11,83,24],[84,11,86,24],[87,6,88,8],[87,11,87,24],[88,11,90,24],[108,6,109,8],[108,11,108,24],[109,11,111,24],[112,6,113,8],[112,11,112,24],[113,11,115,24],[99,6,100,8],[99,11,99,24],[100,11,102,24],[103,6,104,8],[103,11,103,24],[105,11,105,24],[124,6,125,8],[124,11,124,24],[125,11,127,24],[128,6,129,8],[128,11,128,24],[129,11,131,24],[116,6,117,8],[116,11,116,24],[117,11,119,24],[120,6,121,8],[120,11,120,24],[121,11,123,24]]}
[null,null,null,null,null,null,null,null,null,null,null,null,null,null,null,null,null,null,null,null,null,null,null,null,null,null,null,null,null,null,null,null,null,null,null,"بتنی",null,null,"فولادی"]
["سیستم سازه",null,null,"محاسبه و تقسیم بار زلزله",null,null,null,null,null,null,null,null,null,null,null,null,null,null,null,null,null,null,null,null,null,null,null,null,null,null,null,null,null,null,null,{"$f":"'وزن سازه بتنی'!E2","v":"تیپ 1:پارکینگ"},{"$f":"'وزن سازه بتنی'!L33","v":174.25874999999999},{"$f":"'وزن سازه بتنی'!S33","v":34.25},{"$f":"'وزن سازه فولادی'!E2","v":"تیپ 1:زیرزمین"},{"$f":"'وزن سازه فولادی'!L32","v":135.14999999999998},{"$f":"'وزن سازه فولادی'!S32","v":34.25}]
[null,null,null,null,null,null,null,null,null,null,null,null,null,null,null,null,null,null,null,null,null,null,null,null,null,null,null,null,null,null,null,null,null,null,null,{"$f":"'وزن سازه بتنی'!E36","v":"تیپ 2:مسکونی"},{"$f":"'وزن سازه بتنی'!L67","v":183.01874999999998},{"$f":"'وزن سازه بتنی'!S67","v":34.25},{"$f":"'وزن سازه فولادی'!E36","v":"تیپ 2:مسکونی"},{"$f":"'وزن سازه فولادی'!L66","v":149.65875},{"$f":"'وزن سازه فولادی'!S66","v":34.25}]
[null,null,null,null,null,null,null,null,null,null,null,null,null,null,null,null,null,null,null,null,null,null,null,null,null,null,null,null,null,null,null,null,null,null,null,{"$f":"'وزن سازه بتنی'!E70","v":"تیپ 3:بام"},{"$f":"'وزن سازه بتنی'!L101","v":184.77374999999998},{"$f":"'وزن سازه بتنی'!S101","v":27},{"$f":"'وزن سازه فولادی'!E70","v":"تیپ 3:بام"},{"$f":"'وزن سازه فولادی'!L100","v":154.33374999999998},{"$f":"'وزن سازه فولادی'!S100","v":27}]
[null,null,null,null,"جهت تعیین بار جانبی زلزله ابتدا باید وزن سازه و ضریب زازله را بدست آوریم:",null,null,null,null,null,null,null,null,null,null,null,null,null,null,null,null,null,null,null,null,null,null,null,null,null,null,null,null,null,null,{"$f":"'وزن سازه بتنی'!E104","v":"تیپ 4:خرپشته"},{"$f":"'وزن سازه بتنی'!L135","v":28.925000000000004},{"$f":"'وزن سازه بتنی'!S135","v":2.25},{"$f":"'وزن سازه فولادی'!E104","v":"تیپ 4:خرپشته"},{"$f":"'وزن سازه فولادی'!L134","v":20.85},{"$f":"'وزن سازه فولادی'!S134","v":29}]
[null,null,null,null,null,null,null,null,null,null,null,null,null,null,null,null,null,null,null,null,null,null,null,null,null,null,null,null,null,null,null,null,null,null,null,null,null,1,"select"]
[null,null,null,null,"شماره طبقه",null,null,null,"بار مرده",null,null,null,null,null,"بار زنده",null,null,null,null,null,"درصد مشارکت یار زنده",null,null,null,null,null,"مجموع بار مرده و زنده",null,null,null,null,null,null,null,null,null,null,null,{"$f":"IF($AL$6=1,AM2,AJ2)","v":"تیپ 1:زیرزمین"},{"$f":"IF($AL$6=1,AN2,AK2)","v":135.14999999999998},{"$f":"IF($AL$6=1,AO2,AL2)","v":34.25}]
[null,null,null,null,"طبقه اول",null,null,null,{"$f":"CHOOSE(AJ8,$AN$7,$AN$8,$AN$9,$AN$10)","v":135.14999999999998},null,null,null,null,null,{"$f":"CHOOSE(AJ8,$AO$7,$AO$8,$AO$9,$AO$10)","v":34.25},null,null,null,null,null,0.2,null,null,null,null,null,{"$f":"I8+O8*U8","v":141.99999999999997},null,null,null,null,null,null,null,null,1,null,null,{"$f":"IF($AL$6=1,AM3,AJ3)","v":"تیپ 2:مسکونی"},149.65875,34.25]
[null,null,null,null,"طبقه دوم",null,null,null,{"$f":"CHOOSE(AJ9,$AN$7,$AN$8,$AN$9,$AN$10)","v":149.65875},null,null,null,null,null,{"$f":"CHOOSE(AJ9,$AO$7,$AO$8,$AO$9,$AO$10)","v":34.25},null,null,null,null,null,0.2,null,null,null,null,null,{"$f":"I9+O9*U9","v":156.50874999999999},null,null,null,null,null,null,null,null,2,null,null,"تیپ 3:بام",154.33374999999998,27]
[null,null,null,null,"طبقه سوم",null,null,null,149.65875,null,null,null,null,null,34.25,null,null,null,null,null,0.2,null,null,null,null,null,156.50874999999999,null,null,null,null,null,null,null,null,2,null,null,"تیپ 4:خرپشته",20.85,29]
[null,null,null,null,"طبقه چهارم",null,null,null,149.65875,null,null,null,null,null,34.25,null,null,null,null,null,0.2,null,null,null,null,null,156.50874999999999,null,null,null,null,null,null,null,null,2]
[null,null,null,null,"طبقه پنجم",null,null,null,149.65875,null,null,null,null,null,34.25,null,null,null,null,null,0.2,null,null,null,null,null,156.50874999999999,null,null,null,null,null,null,null,null,2]
[null,null,null,null,"طبقه ششم",null,null,null,154.33374999999998,null,null,null,null,null,27,null,null,null,null,null,0.2,null,null,null,null,null,159.73374999999999,null,null,null,null,null,null,null,null,3]
[null,null,null,null,"خرپشته",null,null,null,20.85,null,null,null,null,null,29,null,null,null,null,null,0.2,null,null,null,null,null,26.650000000000002,null,null,null,null,null,null,null,null,4]
[null,null,null,null,null,null,null,null,null,null,null,null,null,null,null,null,null,null,null,null,"مجموع وزن سازه",null,null,null,null,null,{"$f":"AA8+AA9+AA10+AA11+AA12+AA13+AA14","v":954.41874999999982}]
[]
[null,null,null,null,"ضریب زلزله در جهت X",null,null,null,null,null,null,null,null,null,null,null,null,null,"ضریب زلزله در جهت Y"]
[null,null,null,null,{"$f":"خلاصه!H29","v":0.11609999999999999},null,null,null,null,null,null,{"$f":"AA15*E18","v":110.80801687499998},null,null,null,null,null,null,{"$f":"خلاصه!D29","v":9.2700000000000005E-2},null,null,null,null,null,null,{"$f":"AA15*S18","v":88.474618124999992}]
[]
[null,null,null,null,"توزیع نیروی برشی در جهت X"]
[null,null,null,null,"شماره طبقه",null,null,null,"وزن طبقه",null,null,null,null,"ارتفاع طبقه",null,null,null,"ارتفاع از تراز پایه",null,null,null,null,"Wi×Hi",null,null,null,null,"Fi"]
[null,null,null,null,"طبقه اول",null,null,null,{"$f":"AA8","v":141.99999999999997},null,null,null,null,2.8,null,null,null,{"$f":"N22","v":2.8},null,null,null,null,{"$f":"I22*R22","v":397.59999999999991},null,null,null,null,{"$f":"$L$18*W22/$W$28","v":4.2687588217989045}]
[null,null,null,null,"طبقه دوم",null,null,null,{"$f":"AA9","v":156.50874999999999},null,null,null,null,2.8,null,null,null,{"$f":"R22+N23","v":5.6},null,null,null,null,{"$f":"I23*R23","v":876.44899999999996},null,null,null,null,9.4098324964960494]
[null,null,null,null,"طبقه سوم",null,null,null,156.50874999999999,null,null,null,null,3.5,null,null,null,{"$f":"R23+N24","v":9.1},null,null,null,null,1424.2296249999999,null,null,null,null,15.29097780680608]
[null,null,null,null,"طبقه چهارم",null,null,null,156.50874999999999,null,null,null,null,3.5,null,null,null,12.6,null,null,null,null,1972.0102499999998,null,null,null,null,21.172123117116112]
[null,null,null,null,"طبقه پنجم",null,null,null,156.50874999999999,null,null,null,null,3.5,null,null,null,16.100000000000001,null,null,null,null,2519.7908750000001,null,null,null,null,27.053268427426143]
[null,null,null,null,"طبقه ششم",null,null,null,159.73374999999999,null,null,null,null,3.5,null,null,null,19.600000000000001,null,null,null,null,3130.7815000000001,null,null,null,null,33.613056205356671]
[null,null,null,null,null,null,null,null,null,null,null,null,null,null,null,null,null,"ΣWi×Hi=",null,null,null,null,{"$f":"W22+W23+W24+W25+W26+W27","v":10320.861250000002},null,null,null,null,{"$f":"AB22+AB23+AB24+AB25+AB26+AB27","v":110.80801687499996}]
[]
[null,null,null,null,"توزیع نیروی برشی در جهت Y"]
[null,null,null,null,"شماره طبقه",null,null,null,"وزن طبقه",null,null,null,null,"ارتفاع طبقه",null,null,null,"ارتفاع از تراز پایه",null,null,null,null,"Wi×Hi",null,null,null,null,"Fi"]
[null,null,null,null,"طبقه اول",null,null,null,{"$f":"AA8","v":141.99999999999997},null,null,null,null,{"$f":"N22","v":2.8},null,null,null,{"$f":"N32","v":2.8},null,null,null,null,{"$f":"I32*R32","v":397.59999999999991},null,null,null,null,{"$f":"$Z$18*W32/$W$38","v":3.408388826707653}]
[null,null,null,null,"طبقه دوم",null,null,null,{"$f":"AA9","v":156.50874999999999},null,null,null,null,2.8,null,null,null,{"$f":"R32+N33","v":5.6},null,null,null,null,{"$f":"I33*R33","v":876.44899999999996},null,null,null,null,7.5132771096053741]
[null,null,null,null,"طبقه سوم",null,null,null,156.50874999999999,null,null,null,null,3.5,null,null,null,{"$f":"R33+N34","v":9.1},null,null,null,null,1424.2296249999999,null,null,null,null,12.209075303108731]
[null,null,null,null,"طبقه چهارم",null,null,null,156.50874999999999,null,null,null,null,3.5,null,null,null,12.6,null,null,null,null,1972.0102499999998,null,null,null,null,16.90487349661209]
[null,null,null,null,"طبقه پنجم",null,null,null,156.50874999999999,null,null,null,null,3.5,null,null,null,16.100000000000001,null,null,null,null,2519.7908750000001,null,null,null,null,21.600671690115451]
[null,null,null,null,"طبقه ششم",null,null,null,159.73374999999999,null,null,null,null,3.5,null,null,null,19.600000000000001,null,null,null,null,3130.7815000000001,null,null,null,null,26.838331698850677]
[null,null,null,null,null,null,null,null,null,null,null,null,null,null,null,null,null,"ΣWi×Hi=",null,null,null,null,{"$f":"W32+W33+W34+W35+W36+W37","v":10320.861250000002},null,null,null,null,{"$f":"AB32+AB33+AB34+AB35+AB36+AB37","v":88.474618124999978}]
[]
[]
[]
[]
[null,null,null,null,"پخش نیروهای هر تراز بین قاب ها"]
[null,null,null,null,"در جهت X",null,null,null,null,null,null,null,null,null,null,null,null,null,"در جهت Y"]
[null,null,null,null,"سهم قاب مورد نظر از نیروی جانبی (درصد)",null,null,null,null,null,null,null,null,null,null,0.3,null,null,"سهم قاب مورد نظر از نیروی جانبی (درصد)",null,null,null,null,null,null,null,null,null,null,0.2]
[]
[null,null,null,null,"شماره طبقه",null,null,null,"نیرو در جهت X",null,null,null,null,null,"نیرو در جهت Y",null,null,null,null,null,"نیروی جانبی در جهت X",null,null,null,null,null,"نیروی جانبی در جهت Y"]
[null,null,null,null,"طبقه اول",null,null,null,{"$f":"AB22","v":4.2687588217989045},null,null,null,null,null,{"$f":"AB32","v":3.408388826707653},null,null,null,null,null,{"$f":"I48*$P$45","v":1.2806276465396713},null,null,null,null,null,{"$f":"O48*$AD$45","v":0.68167776534153068}]
[null,null,null,null,"طبقه دوم",null,null,null,9.4098324964960494,null,null,null,null,null,7.5132771096053741,null,null,null,null,null,{"$f":"I49*$P$45","v":2.8229497489488149},null,null,null,null,null,{"$f":"O49*$AD$45","v":1.5026554219210748}]
[null,null,null,null,"طبقه سوم",null,null,null,15.29097780680608,null,null,null,null,null,12.209075303108731,null,null,null,null,null,4.587293342041824,null,null,null,null,null,2.4418150606217464]
[null,null,null,null,"طبقه چهارم",null,null,null,21.172123117116112,null,null,null,null,null,16.90487349661209,null,null,null,null,null,6.3516369351348336,null,null,null,null,null,3.3809746993224183]
[null,null,null,null,"طبقه پنجم",null,null,null,27.053268427426143,null,null,null,null,null,21.600671690115451,null,null,null,null,null,8.1159805282278423,null,null,null,null,null,4.3201343380230908]
[null,null,null,null,"طبقه ششم",null,null,null,33.613056205356671,null,null,null,null,null,26.838331698850677,null,null,null,null,null,10.083916861607001,null,null,null,null,null,5.3676663397701354]
[]
[null,null,null,null,"محاسبه لنگر واژگونی در جهت X"]
[null,null,null,null,"شماره طبقه",null,null,null,"ارتفاع طبقه",null,null,null,null,null,"ارتفاع از تراز پابه",null,null,null,null,null,"Fi",null,null,null,null,null,"Fi × Hi"]
[null,null,null,null,"طبقه اول",null,null,null,{"$f":"N22","v":2.8},null,null,null,null,null,{"$f":"I57","v":2.8},null,null,null,null,null,{"$f":"AB22","v":4.2687588217989045},null,null,null,null,null,{"$f":"O57*U57","v":11.952524701036932}]
[null,null,null,null,"طبقه دوم",null,null,null,2.8,null,null,null,null,null,{"$f":"O57+I58","v":5.6},null,null,null,null,null,9.4098324964960494,null,null,null,null,null,{"$f":"O58*U58","v":52.695061980377872}]
[null,null,null,null,"طبقه سوم",null,null,null,3.5,null,null,null,null,null,{"$f":"O58+I59","v":9.1},null,null,null,null,null,15.29097780680608,null,null,null,null,null,139.14789804193532]
[null,null,null,null,"طبقه چهارم",null,null,null,3.5,null,null,null,null,null,12.6,null,null,null,null,null,21.172123117116112,null,null,null,null,null,266.76875127566302]
[null,null,null,null,"طبقه پنجم",null,null,null,3.5,null,null,null,null,null,16.100000000000001,null,null,null,null,null,27.053268427426143,null,null,null,null,null,435.55762168156093]
[null,null,null,null,"طبقه ششم",null,null,null,3.5,null,null,null,null,null,19.600000000000001,null,null,null,null,null,33.613056205356671,null,null,null,null,null,658.81590162499083]
[null,null,null,null,null,null,null,null,null,null,null,null,null,null,null,null,null,null,null,null,"Σ=",null,null,null,null,null,{"$f":"AA57+AA58+AA59+AA60+AA61+AA62","v":1564.9377593055649}]
[]
[null,null,null,null,"محاسبه لنگر مقاوم در جهت X",null,null,null,null,null,null,null,"وزن سازه",null,null,null,null,"مرکز سطح  X",null,null,null,null,"Mrx",null,null,null,null,{"$f":"IF(W66/AA63>=1.75,\"OK\",\"N.OK\")","v":"OK"}]
[null,null,null,null,null,null,null,null,null,null,null,null,{"$f":"AA15","v":954.41874999999982},null,null,null,null,4.1500000000000004,null,null,null,null,{"$f":"M66*R66","v":3960.8378124999995}]
[]
[null,null,null,null,"محاسبه لنگر واژگونی در جهت Y"]
[null,null,null,null,"شماره طبقه",null,null,null,"ارتفاع طبقه",null,null,null,null,null,"ارتفاع از تراز پابه",null,null,null,null,null,"Fi",null,null,null,null,null,"Fi × Hi"]
[null,null,null,null,"طبقه اول",null,null,null,{"$f":"N22","v":2.8},null,null,null,null,null,{"$f":"I70","v":2.8},null,null,null,null,null,{"$f":"AB32","v":3.408388826707653},null,null,null,null,null,{"$f":"O70*U70","v":9.5434887147814269}]
[null,null,null,null,"طبقه دوم",null,null,null,2.8,null,null,null,null,null,{"$f":"O70+I71","v":5.6},null,null,null,null,null,7.5132771096053741,null,null,null,null,null,{"$f":"O71*U71","v":42.074351813790095}]
[null,null,null,null,"طبقه سوم",null,null,null,3.5,null,null,null,null,null,{"$f":"O71+I72","v":9.1},null,null,null,null,null,12.209075303108731,null,null,null,null,null,111.10258525828945]
[null,null,null,null,"طبقه چهارم",null,null,null,3.5,null,null,null,null,null,12.6,null,null,null,null,null,16.90487349661209,null,null,null,null,null,213.00140605731232]
[null,null,null,null,"طبقه پنجم",null,null,null,3.5,null,null,null,null,null,16.100000000000001,null,null,null,null,null,21.600671690115451,null,null,null,null,null,347.77081421085882]
[null,null,null,null,"طبقه ششم",null,null,null,3.5,null,null,null,null,null,19.600000000000001,null,null,null,null,null,26.838331698850677,null,null,null,null,null,526.03130129747331]
[null,null,null,null,null,null,null,null,null,null,null,null,null,null,null,null,null,null,null,null,"Σ=",null,null,null,null,null,{"$f":"AA70+AA71+AA72+AA73+AA74+AA75","v":1249.5239473525053}]
[]
[null,null,null,null,"محاسبه لنگر مقاوم در جهت Y",null,null,null,null,null,null,null,"وزن سازه",null,null,null,null,"مرکز سطح  Y",null,null,null,null,"Mry",null,null,null,null,{"$f":"IF(W79/AA76>=1.75,\"OK\",\"N.OK\")","v":"OK"}]
[null,null,null,null,null,null,null,null,null,null,null,null,{"$f":"AA15","v":954.41874999999982},null,null,null,null,7.2,null,null,null,null,{"$f":"M79*R79","v":6871.8149999999987}]
[]
[]
[]
[]
[null,null,null,null,null,null,{"$f":"U53","v":10.083916861607001},null,null,null,null," 6 st"]
[]
[]
[]
[null,null,null,null,null,null,{"$f":"U52","v":8.1159805282278423},null,null,null,null,"5 st"]
[]
[]
[]
[null,null,null,null,null,null,{"$f":"U51","v":6.3516369351348336},null,null,null,null,"4 st"]
[]
[]
[]
[null,null,null,null,null,null,{"$f":"U50","v":4.587293342041824},null,null,null,null,"3 st"]
[]
[]
[]
[null,null,null,null,null,null,{"$f":"U49","v":2.8229497489488149},null,null,null,null,"2 st"]
[]
[]
[]
[null,null,null,null,null,null,{"$f":"U48","v":1.2806276465396713},null,null,null,null,"1 st"]
[]
[]
[]
[]
[null,null,null,null,null,null,{"$f":"AA53","v":5.3676663397701354},null,null,null,null," 6 st"]
[]
[]
[]
[null,null,null,null,null,null,{"$f":"AA52","v":4.3201343380230908},null,null,null,null,"5 st"]
[]
[]
[]
[null,null,null,null,null,null,{"$f":"AA51","v":3.3809746993224183},null,null,null,null,"4 st"]
[]
[]
[]
[null,null,null,null,null,null,{"$f":"AA50","v":2.4418150606217464},null,null,null,null,"3 st"]
[]
[]
[]
[null,null,null,null,null,null,{"$f":"AA49","v":1.5026554219210748},null,null,null,null,"2 st"]
[]
[]
[]
[null,null,null,null,null,null,{"$f":"AA48","v":0.68167776534153068},null,null,null,null,"1 st"]

{"sheet":"7 طبقه","index":29,"n_rows":138,"n_cols":41,"rows_kept":138,"cut":false,"hidden":false,"merged":[[5,38,5,40],[6,4,6,7],[6,8,6,13],[6,14,6,19],[6,20,6,25],[6,26,6,31],[0,0,0,1],[0,35,0,37],[0,38,0,40],[1,0,1,1],[1,3,2,32],[4,4,4,31],[7,4,7,7],[7,8,7,13],[7,14,7,19],[7,20,7,25],[7,26,7,31],[8,4,8,7],[8,8,8,13],[8,14,8,19],[8,20,8,25],[8,26,8,31],[9,4,9,7],[9,8,9,13],[9,14,9,19],[9,20,9,25],[9,26,9,31],[10,4,10,7],[10,8,10,13],[10,14,10,19],[10,20,10,25],[10,26,10,31],[11,4,11,7],[11,8,11,13],[11,14,11,19],[11,20,11,25],[11,26,11,31],[12,4,12,7],[12,8,12,13],[12,14,12,19],[12,20,12,25],[12,26,12,31],[13,4,13,7],[13,8,13,13],[13,14,13,19],[13,20,13,25],[13,26,13,31],[14,4,14,7],[14,8,14,13],[14,14,14,19],[14,20,14,25],[14,26,14,31],[17,4,17,10],[17,11,17,17],[17,18,17,24],[17,25,17,31],[18,4,18,10],[18,11,18,17],[18,18,18,24],[18,25,18,31],[15,20,15,25],[15,26,15,31],[22,4,22,7],[22,8,22,12],[22,13,22,16],[22,17,22,21],[22,22,22,26],[22,27,22,31],[20,4,20,31],[21,4,21,7],[21,8,21,12],[21,13,21,16],[21,17,21,21],[21,22,21,26],[21,27,21,31],[24,4,24,7],[24,8,24,12],[24,13,24,16],[24,17,24,21],[24,22,24,26],[24,27,24,31],[23,4,23,7],[23,8,23,12],[23,13,23,16],[23,17,23,21],[23,22,23,26],[23,27,23,31],[26,4,26,7],[26,8,26,12],[26,13,26,16],[26,17,26,21],[26,22,26,26],[26,27,26,31],[25,4,25,7],[25,8,25,12],[25,13,25,16],[25,17,25,21],[25,22,25,26],[25,27,25,31],[28,4,28,7],[28,8,28,12],[28,13,28,16],[28,17,28,21],[28,22,28,26],[28,27,28,31],[27,4,27,7],[27,8,27,12],[27,13,27,16],[27,17,27,21],[27,22,27,26],[27,27,27,31],[29,17,29,21],[29,22,29,26],[29,27,29,31],[31,4,31,31],[32,4,32,7],[32,8,32,12],[32,13,32,16],[32,17,32,21],[32,22,32,26],[32,27,32,31],[34,4,34,7],[34,8,34,12],[34,13,34,16],[34,17,34,21],[34,22,34,26],[34,27,34,31],[33,4,33,7],[33,8,33,12],[33,13,33,16],[33,17,33,21],[33,22,33,26],[33,27,33,31],[36,4,36,7],[36,8,36,12],[36,13,36,16],[36,17,36,21],[36,22,36,26],[36,27,36,31],[35,4,35,7],[35,8,35,12],[35,13,35,16],[35,17,35,21],[35,22,35,26],[35,27,35,31],[38,4,38,7],[38,8,38,12],[38,13,38,16],[38,17,38,21],[38,22,38,26],[38,27,38,31],[37,4,37,7],[37,8,37,12],[37,13,37,16],[37,17,37,21],[37,22,37,26],[37,27,37,31],[40,17,40,21],[40,22,40,26],[40,27,40,31],[45,4,45,31],[46,4,46,17],[46,18,46,31],[39,4,39,7],[39,8,39,12],[39,13,39,16],[39,17,39,21],[39,22,39,26],[39,27,39,31],[47,4,47,14],[47,15,47,17],[47,18,47,28],[47,29,47,31],[49,4,49,7],[49,8,49,13],[49,14,49,19],[49,20,49,25],[49,26,49,31],[50,4,50,7],[50,8,50,13],[50,14,50,19],[50,20,50,25],[50,26,50,31],[51,4,51,7],[51,8,51,13],[51,14,51,19],[51,20,51,25],[51,26,51,31],[52,4,52,7],[52,8,52,13],[52,14,52,19],[52,20,52,25],[52,26,52,31],[53,4,53,7],[53,8,53,13],[53,14,53,19],[53,20,53,25],[53,26,53,31],[54,4,54,7],[54,8,54,13],[54,14,54,19],[54,20,54,25],[54,26,54,31],[55,4,55,7],[55,8,55,13],[55,14,55,19],[55,20,55,25],[55,26,55,31],[59,4,59,31],[60,4,60,7],[60,8,60,13],[60,14,60,19],[60,20,60,25],[60,26,60,31],[56,4,56,7],[56,8,56,13],[56,14,56,19],[56,20,56,25],[56,26,56,31],[61,4,61,7],[61,8,61,13],[61,14,61,19],[61,20,61,25],[61,26,61,31],[62,4,62,7],[62,8,62,13],[62,14,62,19],[62,20,62,25],[62,26,62,31],[63,4,63,7],[63,8,63,13],[63,14,63,19],[63,20,63,25],[63,26,63,31],[64,4,64,7],[64,8,64,13],[64,14,64,19],[64,20,64,25],[64,26,64,31],[67,4,67,7],[67,8,67,13],[67,14,67,19],[67,20,67,25],[67,26,67,31],[65,4,65,7],[65,8,65,13],[65,14,65,19],[65,20,65,25],[65,26,65,31],[66,4,66,7],[66,8,66,13],[66,14,66,19],[66,20,66,25],[66,26,66,31],[74,4,74,31],[75,4,75,7],[75,8,75,13],[75,14,75,19],[75,20,75,25],[75,26,75,31],[68,20,68,25],[68,26,68,31],[71,4,72,11],[71,12,71,16],[71,17,71,21],[71,22,71,26],[71,27,72,31],[72,12,72,16],[72,17,72,21],[72,22,72,26],[76,4,76,7],[76,8,76,13],[76,14,76,19],[76,20,76,25],[76,26,76,31],[77,4,77,7],[77,8,77,13],[77,14,77,19],[77,20,77,25],[77,26,77,31],[78,4,78,7],[78,8,78,13],[78,14,78,19],[78,20,78,25],[78,26,78,31],[79,4,79,7],[79,8,79,13],[79,14,79,19],[79,20,79,25],[79,26,79,31],[82,4,82,7],[82,8,82,13],[82,14,82,19],[82,20,82,25],[82,26,82,31],[80,4,80,7],[80,8,80,13],[80,14,80,19],[80,20,80,25],[80,26,80,31],[81,4,81,7],[81,8,81,13],[81,14,81,19],[81,20,81,25],[81,26,81,31],[83,20,83,25],[83,26,83,31],[86,4,87,11],[86,12,86,16],[86,17,86,21],[86,22,86,26],[86,27,87,31],[87,12,87,16],[87,17,87,21],[87,22,87,26],[98,6,99,8],[98,11,98,24],[99,11,100,24],[101,6,102,8],[101,11,101,24],[102,11,103,24],[95,6,96,8],[95,11,95,24],[96,11,97,24],[110,6,111,8],[110,11,110,24],[111,11,112,24],[113,6,114,8],[113,11,113,24],[114,11,115,24],[104,6,105,8],[104,11,104,24],[105,11,106,24],[107,6,108,8],[107,11,107,24],[108,11,109,24],[122,6,123,8],[122,11,122,24],[123,11,124,24],[125,6,126,8],[125,11,125,24],[126,11,127,24],[119,6,120,8],[119,11,119,24],[120,11,121,24],[138,11,139,24],[134,6,135,8],[134,11,134,24],[135,11,136,24],[137,6,138,8],[137,11,137,24],[128,6,129,8],[128,11,128,24],[129,11,130,24],[131,6,132,8],[131,11,131,24],[132,11,133,24]]}
[null,null,null,null,null,null,null,null,null,null,null,null,null,null,null,null,null,null,null,null,null,null,null,null,null,null,null,null,null,null,null,null,null,null,null,"بتنی",null,null,"فولادی"]
["سیستم سازه",null,null,"محاسبه و تقسیم بار زلزله",null,null,null,null,null,null,null,null,null,null,null,null,null,null,null,null,null,null,null,null,null,null,null,null,null,null,null,null,null,null,null,{"$f":"'وزن سازه بتنی'!E2","v":"تیپ 1:پارکینگ"},{"$f":"'وزن سازه بتنی'!L33","v":174.25874999999999},{"$f":"'وزن سازه بتنی'!S33","v":34.25},{"$f":"'وزن سازه فولادی'!E2","v":"تیپ 1:زیرزمین"},{"$f":"'وزن سازه فولادی'!L32","v":135.14999999999998},{"$f":"'وزن سازه فولادی'!S32","v":34.25}]
[null,null,null,null,null,null,null,null,null,null,null,null,null,null,null,null,null,null,null,null,null,null,null,null,null,null,null,null,null,null,null,null,null,null,null,{"$f":"'وزن سازه بتنی'!E36","v":"تیپ 2:مسکونی"},{"$f":"'وزن سازه بتنی'!L67","v":183.01874999999998},{"$f":"'وزن سازه بتنی'!S67","v":34.25},{"$f":"'وزن سازه فولادی'!E36","v":"تیپ 2:مسکونی"},{"$f":"'وزن سازه فولادی'!L66","v":149.65875},{"$f":"'وزن سازه فولادی'!S66","v":34.25}]
[null,null,null,null,null,null,null,null,null,null,null,null,null,null,null,null,null,null,null,null,null,null,null,null,null,null,null,null,null,null,null,null,null,null,null,{"$f":"'وزن سازه بتنی'!E70","v":"تیپ 3:بام"},{"$f":"'وزن سازه بتنی'!L101","v":184.77374999999998},{"$f":"'وزن سازه بتنی'!S101","v":27},{"$f":"'وزن سازه فولادی'!E70","v":"تیپ 3:بام"},{"$f":"'وزن سازه فولادی'!L100","v":154.33374999999998},{"$f":"'وزن سازه فولادی'!S100","v":27}]
[null,null,null,null,"جهت تعیین بار جانبی زلزله ابتدا باید وزن سازه و ضریب زازله را بدست آوریم:",null,null,null,null,null,null,null,null,null,null,null,null,null,null,null,null,null,null,null,null,null,null,null,null,null,null,null,null,null,null,{"$f":"'وزن سازه بتنی'!E104","v":"تیپ 4:خرپشته"},{"$f":"'وزن سازه بتنی'!L135","v":28.925000000000004},{"$f":"'وزن سازه بتنی'!S135","v":2.25},{"$f":"'وزن سازه فولادی'!E104","v":"تیپ 4:خرپشته"},{"$f":"'وزن سازه فولادی'!L134","v":20.85},{"$f":"'وزن سازه فولادی'!S134","v":29}]
[null,null,null,null,null,null,null,null,null,null,null,null,null,null,null,null,null,null,null,null,null,null,null,null,null,null,null,null,null,null,null,null,null,null,null,null,null,2,"select"]
[null,null,null,null,"شماره طبقه",null,null,null,"بار مرده",null,null,null,null,null,"بار زنده",null,null,null,null,null,"درصد مشارکت یار زنده",null,null,null,null,null,"مجموع بار مرده و زنده",null,null,null,null,null,null,null,null,null,null,null,{"$f":"IF($AL$6=1,AM2,AJ2)","v":"تیپ 1:پارکینگ"},{"$f":"IF($AL$6=1,AN2,AK2)","v":174.25874999999999},{"$f":"IF($AL$6=1,AO2,AL2)","v":34.25}]
[null,null,null,null,"طبقه اول",null,null,null,{"$f":"CHOOSE(AJ8,$AN$7,$AN$8,$AN$9,$AN$10)","v":174.25874999999999},null,null,null,null,null,{"$f":"CHOOSE(AJ8,$AO$7,$AO$8,$AO$9,$AO$10)","v":34.25},null,null,null,null,null,0.2,null,null,null,null,null,{"$f":"I8+O8*U8","v":181.10874999999999},null,null,null,null,null,null,null,null,1,null,null,{"$f":"IF($AL$6=1,AM3,AJ3)","v":"تیپ 2:مسکونی"},183.01874999999998,34.25]
[null,null,null,null,"طبقه دوم",null,null,null,{"$f":"CHOOSE(AJ9,$AN$7,$AN$8,$AN$9,$AN$10)","v":183.01874999999998},null,null,null,null,null,{"$f":"CHOOSE(AJ9,$AO$7,$AO$8,$AO$9,$AO$10)","v":34.25},null,null,null,null,null,0.2,null,null,null,null,null,{"$f":"I9+O9*U9","v":189.86874999999998},null,null,null,null,null,null,null,null,2,null,null,"تیپ 3:بام",184.77374999999998,27]
[null,null,null,null,"طبقه سوم",null,null,null,183.01874999999998,null,null,null,null,null,34.25,null,null,null,null,null,0.2,null,null,null,null,null,189.86874999999998,null,null,null,null,null,null,null,null,2,null,null,"تیپ 4:خرپشته",28.925000000000004,2.25]
[null,null,null,null,"طبقه چهارم",null,null,null,183.01874999999998,null,null,null,null,null,34.25,null,null,null,null,null,0.2,null,null,null,null,null,189.86874999999998,null,null,null,null,null,null,null,null,2]
[null,null,null,null,"طبقه پنجم",null,null,null,183.01874999999998,null,null,null,null,null,34.25,null,null,null,null,null,0.2,null,null,null,null,null,189.86874999999998,null,null,null,null,null,null,null,null,2]
[null,null,null,null,"طبقه ششم",null,null,null,183.01874999999998,null,null,null,null,null,34.25,null,null,null,null,null,0.2,null,null,null,null,null,189.86874999999998,null,null,null,null,null,null,null,null,2]
[null,null,null,null,"طبقه هفتم",null,null,null,183.01874999999998,null,null,null,null,null,34.25,null,null,null,null,null,0.2,null,null,null,null,null,189.86874999999998,null,null,null,null,null,null,null,null,2]
[null,null,null,null,"خرپشته",null,null,null,184.77374999999998,null,null,null,null,null,27,null,null,null,null,null,0.2,null,null,null,null,null,190.17374999999998,null,null,null,null,null,null,null,null,3]
[null,null,null,null,null,null,null,null,null,null,null,null,null,null,null,null,null,null,null,null,"مجموع وزن سازه",null,null,null,null,null,{"$f":"AA8+AA9+AA10+AA11+AA12+AA13+AA14+AA15","v":1510.4949999999999}]
[]
[null,null,null,null,"ضریب زلزله در جهت X",null,null,null,null,null,null,null,null,null,null,null,null,null,"ضریب زلزله در جهت Y"]
[null,null,null,null,{"$f":"خلاصه!H29","v":0.11609999999999999},null,null,null,null,null,null,{"$f":"AA16*E19","v":175.36846949999997},null,null,null,null,null,null,{"$f":"خلاصه!D29","v":9.2700000000000005E-2},null,null,null,null,null,null,{"$f":"AA16*S19","v":140.0228865}]
[]
[null,null,null,null,"توزیع نیروی برشی در جهت X"]
[null,null,null,null,"شماره طبقه",null,null,null,"وزن طبقه",null,null,null,null,"ارتفاع طبقه",null,null,null,"ارتفاع از تراز پایه",null,null,null,null,"Wi×Hi",null,null,null,null,"Fi"]
[null,null,null,null,"طبقه اول",null,null,null,{"$f":"AA8","v":181.10874999999999},null,null,null,null,2.8,null,null,null,{"$f":"N23","v":2.8},null,null,null,null,{"$f":"I23*R23","v":507.10449999999992},null,null,null,null,{"$f":"$L$19*W23/$W$30","v":5.2762488784262249}]
[null,null,null,null,"طبقه دوم",null,null,null,189.86874999999998,null,null,null,null,2.8,null,null,null,{"$f":"R23+N24","v":5.6},null,null,null,null,{"$f":"I24*R24","v":1063.2649999999999},null,null,null,null,11.062908658313741]
[null,null,null,null,"طبقه سوم",null,null,null,189.86874999999998,null,null,null,null,3.5,null,null,null,{"$f":"R24+N25","v":9.1},null,null,null,null,1727.8056249999997,null,null,null,null,17.977226569759829]
[null,null,null,null,"طبقه چهارم",null,null,null,189.86874999999998,null,null,null,null,3.5,null,null,null,12.6,null,null,null,null,2392.3462499999996,null,null,null,null,24.891544481205916]
[null,null,null,null,"طبقه پنجم",null,null,null,189.86874999999998,null,null,null,null,3.5,null,null,null,16.100000000000001,null,null,null,null,3056.8868749999997,null,null,null,null,31.805862392652003]
[null,null,null,null,"طبقه ششم",null,null,null,189.86874999999998,null,null,null,null,3.5,null,null,null,19.600000000000001,null,null,null,null,3721.4274999999998,null,null,null,null,38.720180304098093]
[null,null,null,null,"طبقه هفتم",null,null,null,189.86874999999998,null,null,null,null,3.5,null,null,null,23.1,null,null,null,null,4385.9681249999994,null,null,null,null,45.634498215544177]
[null,null,null,null,null,null,null,null,null,null,null,null,null,null,null,null,null,"ΣWi×Hi=",null,null,null,null,{"$f":"W23+W24+W25+W26+W27+W28+W29","v":16854.803874999998},null,null,null,null,{"$f":"AB23+AB24+AB25+AB26+AB27+AB28+AB29","v":175.36846949999997}]
[]
[null,null,null,null,"توزیع نیروی برشی در جهت Y"]
[null,null,null,null,"شماره طبقه",null,null,null,"وزن طبقه",null,null,null,null,"ارتفاع طبقه",null,null,null,"ارتفاع از تراز پایه",null,null,null,null,"Wi×Hi",null,null,null,null,"Fi"]
[null,null,null,null,"طبقه اول",null,null,null,{"$f":"AA8","v":181.10874999999999},null,null,null,null,{"$f":"N23","v":2.8},null,null,null,{"$f":"N34","v":2.8},null,null,null,null,{"$f":"I34*R34","v":507.10449999999992},null,null,null,null,{"$f":"$Z$19*W34/$W$41","v":4.2128188719217148}]
[null,null,null,null,"طبقه دوم",null,null,null,189.86874999999998,null,null,null,null,2.8,null,null,null,{"$f":"R34+N35","v":5.6},null,null,null,null,{"$f":"I35*R35","v":1063.2649999999999},null,null,null,null,8.8331751302815142]
[null,null,null,null,"طبقه سوم",null,null,null,189.86874999999998,null,null,null,null,3.5,null,null,null,{"$f":"R35+N36","v":9.1},null,null,null,null,1727.8056249999997,null,null,null,null,14.353909586707461]
[null,null,null,null,"طبقه چهارم",null,null,null,189.86874999999998,null,null,null,null,3.5,null,null,null,12.6,null,null,null,null,2392.3462499999996,null,null,null,null,19.874644043133408]
[null,null,null,null,"طبقه پنجم",null,null,null,189.86874999999998,null,null,null,null,3.5,null,null,null,16.100000000000001,null,null,null,null,3056.8868749999997,null,null,null,null,25.395378499559353]
[null,null,null,null,"طبقه ششم",null,null,null,189.86874999999998,null,null,null,null,3.5,null,null,null,19.600000000000001,null,null,null,null,3721.4274999999998,null,null,null,null,30.916112955985302]
[null,null,null,null,"طبقه هفتم",null,null,null,189.86874999999998,null,null,null,null,3.5,null,null,null,23.1,null,null,null,null,4385.9681249999994,null,null,null,null,36.436847412411247]
[null,null,null,null,null,null,null,null,null,null,null,null,null,null,null,null,null,"ΣWi×Hi=",null,null,null,null,{"$f":"W34+W35+W36+W37+W38+W39+W40","v":16854.803874999998},null,null,null,null,{"$f":"AB34+AB35+AB36+AB37+AB38+AB39+AB40","v":140.0228865}]
[]
[]
[]
[]
[null,null,null,null,"پخش نیروهای هر تراز بین قاب ها"]
[null,null,null,null,"در جهت X",null,null,null,null,null,null,null,null,null,null,null,null,null,"در جهت Y"]
[null,null,null,null,"سهم قاب مورد نظر از نیروی جانبی (درصد)",null,null,null,null,null,null,null,null,null,null,0.25,null,null,"سهم قاب مورد نظر از نیروی جانبی (درصد)",null,null,null,null,null,null,null,null,null,null,0.25]
[]
[null,null,null,null,"شماره طبقه",null,null,null,"نیرو در جهت X",null,null,null,null,null,"نیرو در جهت Y",null,null,null,null,null,"نیروی جانبی در جهت X",null,null,null,null,null,"نیروی جانبی در جهت Y"]
[null,null,null,null,"طبقه اول",null,null,null,{"$f":"AB23","v":5.2762488784262249},null,null,null,null,null,{"$f":"AB34","v":4.2128188719217148},null,null,null,null,null,{"$f":"I51*$P$48","v":1.3190622196065562},null,null,null,null,null,{"$f":"O51*$AD$48","v":1.0532047179804287}]
[null,null,null,null,"طبقه دوم",null,null,null,11.062908658313741,null,null,null,null,null,8.8331751302815142,null,null,null,null,null,2.7657271645784354,null,null,null,null,null,2.2082937825703786]
[null,null,null,null,"طبقه سوم",null,null,null,17.977226569759829,null,null,null,null,null,14.353909586707461,null,null,null,null,null,4.4943066424399571,null,null,null,null,null,3.5884773966768653]
[null,null,null,null,"طبقه چهارم",null,null,null,24.891544481205916,null,null,null,null,null,19.874644043133408,null,null,null,null,null,6.2228861203014789,null,null,null,null,null,4.968661010783352]
[null,null,null,null,"طبقه پنجم",null,null,null,31.805862392652003,null,null,null,null,null,25.395378499559353,null,null,null,null,null,7.9514655981630007,null,null,null,null,null,6.3488446248898383]
[null,null,null,null,"طبقه ششم",null,null,null,38.720180304098093,null,null,null,null,null,30.916112955985302,null,null,null,null,null,9.6800450760245234,null,null,null,null,null,7.7290282389963254]
[null,null,null,null,"طبقه هفتم",null,null,null,45.634498215544177,null,null,null,null,null,36.436847412411247,null,null,null,null,null,11.408624553886044,null,null,null,null,null,9.1092118531028117]
[]
[]
[null,null,null,null,"محاسبه لنگر واژگونی در جهت X"]
[null,null,null,null,"شماره طبقه",null,null,null,"ارتفاع طبقه",null,null,null,null,null,"ارتفاع از تراز پابه",null,null,null,null,null,"Fi",null,null,null,null,null,"Fi × Hi"]
[null,null,null,null,"طبقه اول",null,null,null,{"$f":"N23","v":2.8},null,null,null,null,null,{"$f":"I62","v":2.8},null,null,null,null,null,{"$f":"AB23","v":5.2762488784262249},null,null,null,null,null,{"$f":"O62*U62","v":14.773496859593429}]
[null,null,null,null,"طبقه دوم",null,null,null,2.8,null,null,null,null,null,{"$f":"O62+I63","v":5.6},null,null,null,null,null,11.062908658313741,null,null,null,null,null,{"$f":"O63*U63","v":61.952288486556945}]
[null,null,null,null,"طبقه سوم",null,null,null,3.5,null,null,null,null,null,{"$f":"O63+I64","v":9.1},null,null,null,null,null,17.977226569759829,null,null,null,null,null,163.59276178481443]
[null,null,null,null,"طبقه چهارم",null,null,null,3.5,null,null,null,null,null,12.6,null,null,null,null,null,24.891544481205916,null,null,null,null,null,313.63346046319452]
[null,null,null,null,"طبقه پنجم",null,null,null,3.5,null,null,null,null,null,16.100000000000001,null,null,null,null,null,31.805862392652003,null,null,null,null,null,512.07438452169731]
[null,null,null,null,"طبقه ششم",null,null,null,3.5,null,null,null,null,null,19.600000000000001,null,null,null,null,null,38.720180304098093,null,null,null,null,null,758.9155339603227]
[null,null,null,null,"طبقه هفتم",null,null,null,3.5,null,null,null,null,null,23.1,null,null,null,null,null,45.634498215544177,null,null,null,null,null,1054.1569087790706]
[null,null,null,null,null,null,null,null,null,null,null,null,null,null,null,null,null,null,null,null,"Σ=",null,null,null,null,null,{"$f":"AA62+AA63+AA64+AA65+AA66+AA67+AA68","v":2879.0988348552501}]
[]
[]
[null,null,null,null,"محاسبه لنگر مقاوم در جهت X",null,null,null,null,null,null,null,"وزن سازه",null,null,null,null,"مرکز سطح  X",null,null,null,null,"Mrx",null,null,null,null,{"$f":"IF(W73/AA69>=1.75,\"OK\",\"N.OK\")","v":"OK"}]
[null,null,null,null,null,null,null,null,null,null,null,null,{"$f":"AA16","v":1510.4949999999999},null,null,null,null,4.1500000000000004,null,null,null,null,{"$f":"M73*R73","v":6268.5542500000001}]
[]
[null,null,null,null,"محاسبه لنگر واژگونی در جهت Y"]
[null,null,null,null,"شماره طبقه",null,null,null,"ارتفاع طبقه",null,null,null,null,null,"ارتفاع از تراز پابه",null,null,null,null,null,"Fi",null,null,null,null,null,"Fi × Hi"]
[null,null,null,null,"طبقه اول",null,null,null,{"$f":"N23","v":2.8},null,null,null,null,null,{"$f":"I77","v":2.8},null,null,null,null,null,{"$f":"AB34","v":4.2128188719217148},null,null,null,null,null,{"$f":"O77*U77","v":11.7958928413808}]
[null,null,null,null,"طبقه دوم",null,null,null,2.8,null,null,null,null,null,{"$f":"O77+I78","v":5.6},null,null,null,null,null,8.8331751302815142,null,null,null,null,null,{"$f":"O78*U78","v":49.46578072957648}]
[null,null,null,null,"طبقه سوم",null,null,null,3.5,null,null,null,null,null,{"$f":"O78+I79","v":9.1},null,null,null,null,null,14.353909586707461,null,null,null,null,null,130.62057723903789]
[null,null,null,null,"طبقه چهارم",null,null,null,3.5,null,null,null,null,null,12.6,null,null,null,null,null,19.874644043133408,null,null,null,null,null,250.42051494348092]
[null,null,null,null,"طبقه پنجم",null,null,null,3.5,null,null,null,null,null,16.100000000000001,null,null,null,null,null,25.395378499559353,null,null,null,null,null,408.86559384290564]
[null,null,null,null,"طبقه ششم",null,null,null,3.5,null,null,null,null,null,19.600000000000001,null,null,null,null,null,30.916112955985302,null,null,null,null,null,605.95581393731197]
[null,null,null,null,"طبقه هفتم",null,null,null,3.5,null,null,null,null,null,23.1,null,null,null,null,null,36.436847412411247,null,null,null,null,null,841.6911752266999]
[null,null,null,null,null,null,null,null,null,null,null,null,null,null,null,null,null,null,null,null,"Σ=",null,null,null,null,null,{"$f":"AA77+AA78+AA79+AA80+AA81+AA82+AA83","v":2298.8153487603936}]
[]
[]
[null,null,null,null,"محاسبه لنگر مقاوم در جهت Y",null,null,null,null,null,null,null,"وزن سازه",null,null,null,null,"مرکز سطح  Y",null,null,null,null,"Mry",null,null,null,null,{"$f":"IF(W88/AA84>=1.75,\"OK\",\"N.OK\")","v":"OK"}]
[null,null,null,null,null,null,null,null,null,null,null,null,{"$f":"AA16","v":1510.4949999999999},null,null,null,null,7.2,null,null,null,null,{"$f":"M88*R88","v":10875.564}]
[]
[]
[]
[]
[]
[]
[]
[null,null,null,null,null,null,{"$f":"U57","v":11.408624553886044},null,null,null,null,"7 st"]
[]
[]
[null,null,null,null,null,null,{"$f":"U56","v":9.6800450760245234},null,null,null,null," 6 st"]
[]
[]
[null,null,null,null,null,null,{"$f":"U55","v":7.9514655981630007},null,null,null,null,"5 st"]
[]
[]
[null,null,null,null,null,null,{"$f":"U54","v":6.2228861203014789},null,null,null,null,"4 st"]
[]
[]
[null,null,null,null,null,null,{"$f":"U53","v":4.4943066424399571},null,null,null,null,"3 st"]
[]
[]
[null,null,null,null,null,null,{"$f":"U52","v":2.7657271645784354},null,null,null,null,"2 st"]
[]
[]
[null,null,null,null,null,null,{"$f":"U51","v":1.3190622196065562},null,null,null,null,"1 st"]
[]
[]
[]
[]
[]
[null,null,null,null,null,null,{"$f":"AA57","v":9.1092118531028117},null,null,null,null,"7 st"]
[]
[]
[null,null,null,null,null,null,{"$f":"AA56","v":7.7290282389963254},null,null,null,null," 6 st"]
[]
[]
[null,null,null,null,null,null,{"$f":"AA55","v":6.3488446248898383},null,null,null,null,"5 st"]
[]
[]
[null,null,null,null,null,null,{"$f":"AA54","v":4.968661010783352},null,null,null,null,"4 st"]
[]
[]
[null,null,null,null,null,null,{"$f":"AA53","v":3.5884773966768653},null,null,null,null,"3 st"]
[]
[]
[null,null,null,null,null,null,{"$f":"AA52","v":2.2082937825703786},null,null,null,null,"2 st"]
[]
[]
[null,null,null,null,null,null,{"$f":"AA51","v":1.0532047179804287},null,null,null,null,"1 st"]

{"sheet":"8 طبقه","index":30,"n_rows":143,"n_cols":41,"rows_kept":143,"cut":false,"hidden":false,"merged":[[0,38,0,40],[5,38,5,40],[0,0,0,1],[1,0,1,1],[117,6,118,8],[133,11,133,24],[124,11,124,24],[125,11,126,24],[127,11,127,24],[128,11,129,24],[130,11,130,24],[131,11,132,24],[0,35,0,37],[117,11,117,24],[118,11,119,24],[115,11,116,24],[99,11,99,24],[100,11,101,24],[102,11,102,24],[103,11,104,24],[105,11,105,24],[106,11,107,24],[114,11,114,24],[105,6,106,8],[136,6,137,8],[139,6,140,8],[142,6,143,8],[121,6,122,8],[124,6,125,8],[127,6,128,8],[130,6,131,8],[133,6,134,8],[142,11,142,24],[143,11,144,24],[134,11,135,24],[136,11,136,24],[137,11,138,24],[139,11,139,24],[140,11,141,24],[121,11,121,24],[122,11,123,24],[108,6,109,8],[111,6,112,8],[114,6,115,8],[108,11,108,24],[109,11,110,24],[111,11,111,24],[112,11,113,24],[90,27,91,31],[91,12,91,16],[91,17,91,21],[91,22,91,26],[90,4,91,11],[90,12,90,16],[90,17,90,21],[90,22,90,26],[96,11,96,24],[97,11,98,24],[96,6,97,8],[99,6,100,8],[102,6,103,8],[87,4,87,7],[87,8,87,13],[87,14,87,19],[87,20,87,25],[87,26,87,31],[88,20,88,25],[88,26,88,31],[85,26,85,31],[86,4,86,7],[86,8,86,13],[86,14,86,19],[86,20,86,25],[86,26,86,31],[85,4,85,7],[85,8,85,13],[85,14,85,19],[85,20,85,25],[83,4,83,7],[83,8,83,13],[83,14,83,19],[83,20,83,25],[83,26,83,31],[84,4,84,7],[84,8,84,13],[84,14,84,19],[84,20,84,25],[84,26,84,31],[81,4,81,7],[81,8,81,13],[81,14,81,19],[81,20,81,25],[81,26,81,31],[82,4,82,7],[82,8,82,13],[82,14,82,19],[82,20,82,25],[82,26,82,31],[79,20,79,25],[79,26,79,31],[80,4,80,7],[80,8,80,13],[80,14,80,19],[80,20,80,25],[80,26,80,31],[73,26,73,31],[75,4,76,11],[75,12,75,16],[75,17,75,21],[75,22,75,26],[75,27,76,31],[76,12,76,16],[76,17,76,21],[76,22,76,26],[78,4,78,31],[79,4,79,7],[79,8,79,13],[79,14,79,19],[73,20,73,25],[71,4,71,7],[71,8,71,13],[71,14,71,19],[71,20,71,25],[71,26,71,31],[72,4,72,7],[72,8,72,13],[72,14,72,19],[72,20,72,25],[72,26,72,31],[69,4,69,7],[69,8,69,13],[69,14,69,19],[69,20,69,25],[69,26,69,31],[70,4,70,7],[70,8,70,13],[70,14,70,19],[70,20,70,25],[70,26,70,31],[67,14,67,19],[67,20,67,25],[67,26,67,31],[68,4,68,7],[68,8,68,13],[68,14,68,19],[68,20,68,25],[68,26,68,31],[58,26,58,31],[63,4,63,31],[65,4,65,7],[65,8,65,13],[65,14,65,19],[66,4,66,7],[66,8,66,13],[66,14,66,19],[66,20,66,25],[66,26,66,31],[67,4,67,7],[67,8,67,13],[64,4,64,7],[64,8,64,13],[64,14,64,19],[64,20,64,25],[38,22,38,26],[40,22,40,26],[40,27,40,31],[56,14,56,19],[56,20,56,25],[56,26,56,31],[57,4,57,7],[57,8,57,13],[57,14,57,19],[57,20,57,25],[57,26,57,31],[54,4,54,7],[54,8,54,13],[54,14,54,19],[54,20,54,25],[54,26,54,31],[55,4,55,7],[55,8,55,13],[55,14,55,19],[55,20,55,25],[55,26,55,31],[56,4,56,7],[56,8,56,13],[38,27,38,31],[39,8,39,12],[39,13,39,16],[39,17,39,21],[39,22,39,26],[39,27,39,31],[34,4,34,31],[43,8,43,12],[43,13,43,16],[42,8,42,12],[42,13,42,16],[42,17,42,21],[42,22,42,26],[42,27,42,31],[43,17,43,21],[43,22,43,26],[43,27,43,31],[40,8,40,12],[40,13,40,16],[40,17,40,21],[38,4,38,7],[38,8,38,12],[38,13,38,16],[38,17,38,21],[35,8,35,12],[35,13,35,16],[35,17,35,21],[35,22,35,26],[35,27,35,31],[37,8,37,12],[37,13,37,16],[37,17,37,21],[37,22,37,26],[37,27,37,31],[24,27,24,31],[25,4,25,7],[25,8,25,12],[25,13,25,16],[25,17,25,21],[25,22,25,26],[25,27,25,31],[28,4,28,7],[28,8,28,12],[28,13,28,16],[28,17,28,21],[28,22,28,26],[28,27,28,31],[26,27,26,31],[27,4,27,7],[27,8,27,12],[27,13,27,16],[27,17,27,21],[27,22,27,26],[27,27,27,31],[26,4,26,7],[26,8,26,12],[26,13,26,16],[26,17,26,21],[16,20,16,25],[16,26,16,31],[18,4,18,10],[18,11,18,17],[18,18,18,24],[18,25,18,31],[23,4,23,7],[23,17,23,21],[23,22,23,26],[23,27,23,31],[22,27,22,31],[21,4,21,31],[19,4,19,10],[19,11,19,17],[19,18,19,24],[19,25,19,31],[14,4,14,7],[14,8,14,13],[14,14,14,19],[14,20,14,25],[14,26,14,31],[15,4,15,7],[15,8,15,13],[15,14,15,19],[15,20,15,25],[15,26,15,31],[12,14,12,19],[12,20,12,25],[12,26,12,31],[13,4,13,7],[13,8,13,13],[13,14,13,19],[13,20,13,25],[13,26,13,31],[4,4,4,31],[12,4,12,7],[11,4,11,7],[11,8,11,13],[11,14,11,19],[11,20,11,25],[11,26,11,31],[12,8,12,13],[9,4,9,7],[9,8,9,13],[9,14,9,19],[9,20,9,25],[9,26,9,31],[10,4,10,7],[10,8,10,13],[10,14,10,19],[64,26,64,31],[65,20,65,25],[65,26,65,31],[60,4,60,7],[60,8,60,13],[60,14,60,19],[60,20,60,25],[60,26,60,31],[61,4,61,7],[61,8,61,13],[61,14,61,19],[61,20,61,25],[61,26,61,31],[59,4,59,7],[59,8,59,13],[59,14,59,19],[59,20,59,25],[59,26,59,31],[58,4,58,7],[58,8,58,13],[58,14,58,19],[58,20,58,25],[53,20,53,25],[53,26,53,31],[53,4,53,7],[53,8,53,13],[53,14,53,19],[42,4,42,7],[43,4,43,7],[40,4,40,7],[41,4,41,7],[49,4,49,31],[50,4,50,17],[50,18,50,31],[51,4,51,14],[51,15,51,17],[51,18,51,28],[51,29,51,31],[41,17,41,21],[41,22,41,26],[41,27,41,31],[41,8,41,12],[41,13,41,16],[44,17,44,21],[44,22,44,26],[44,27,44,31],[39,4,39,7],[37,4,37,7],[30,4,30,7],[30,8,30,12],[30,13,30,16],[30,17,30,21],[30,22,30,26],[30,27,30,31],[29,4,29,7],[29,8,29,12],[29,13,29,16],[29,17,29,21],[29,22,29,26],[29,27,29,31],[31,17,31,21],[31,22,31,26],[31,27,31,31],[36,4,36,7],[36,8,36,12],[36,13,36,16],[36,17,36,21],[36,22,36,26],[36,27,36,31],[35,4,35,7],[26,22,26,26],[22,4,22,7],[22,8,22,12],[22,13,22,16],[22,17,22,21],[22,22,22,26],[23,8,23,12],[23,13,23,16],[24,4,24,7],[24,8,24,12],[24,13,24,16],[24,17,24,21],[24,22,24,26],[6,4,6,7],[6,8,6,13],[6,14,6,19],[6,20,6,25],[6,26,6,31],[1,3,2,32],[10,20,10,25],[10,26,10,31],[7,4,7,7],[7,8,7,13],[7,14,7,19],[7,20,7,25],[7,26,7,31],[8,4,8,7],[8,8,8,13],[8,14,8,19],[8,20,8,25],[8,26,8,31]]}
[null,null,null,null,null,null,null,null,null,null,null,null,null,null,null,null,null,null,null,null,null,null,null,null,null,null,null,null,null,null,null,null,null,null,null,"بتنی",null,null,"فولادی"]
["سیستم سازه",null,null,"محاسبه و تقسیم بار زلزله",null,null,null,null,null,null,null,null,null,null,null,null,null,null,null,null,null,null,null,null,null,null,null,null,null,null,null,null,null,null,null,{"$f":"'وزن سازه بتنی'!E2","v":"تیپ 1:پارکینگ"},{"$f":"'وزن سازه بتنی'!L33","v":174.25874999999999},{"$f":"'وزن سازه بتنی'!S33","v":34.25},{"$f":"'وزن سازه فولادی'!E2","v":"تیپ 1:زیرزمین"},{"$f":"'وزن سازه فولادی'!L32","v":135.14999999999998},{"$f":"'وزن سازه فولادی'!S32","v":34.25}]
[null,null,null,null,null,null,null,null,null,null,null,null,null,null,null,null,null,null,null,null,null,null,null,null,null,null,null,null,null,null,null,null,null,null,null,{"$f":"'وزن سازه بتنی'!E36","v":"تیپ 2:مسکونی"},{"$f":"'وزن سازه بتنی'!L67","v":183.01874999999998},{"$f":"'وزن سازه بتنی'!S67","v":34.25},{"$f":"'وزن سازه فولادی'!E36","v":"تیپ 2:مسکونی"},{"$f":"'وزن سازه فولادی'!L66","v":149.65875},{"$f":"'وزن سازه فولادی'!S66","v":34.25}]
[null,null,null,null,null,null,null,null,null,null,null,null,null,null,null,null,null,null,null,null,null,null,null,null,null,null,null,null,null,null,null,null,null,null,null,{"$f":"'وزن سازه بتنی'!E70","v":"تیپ 3:بام"},{"$f":"'وزن سازه بتنی'!L101","v":184.77374999999998},{"$f":"'وزن سازه بتنی'!S101","v":27},{"$f":"'وزن سازه فولادی'!E70","v":"تیپ 3:بام"},{"$f":"'وزن سازه فولادی'!L100","v":154.33374999999998},{"$f":"'وزن سازه فولادی'!S100","v":27}]
[null,null,null,null,"جهت تعیین بار جانبی زلزله ابتدا باید وزن سازه و ضریب زازله را بدست آوریم:",null,null,null,null,null,null,null,null,null,null,null,null,null,null,null,null,null,null,null,null,null,null,null,null,null,null,null,null,null,null,{"$f":"'وزن سازه بتنی'!E104","v":"تیپ 4:خرپشته"},{"$f":"'وزن سازه بتنی'!L135","v":28.925000000000004},{"$f":"'وزن سازه بتنی'!S135","v":2.25},{"$f":"'وزن سازه فولادی'!E104","v":"تیپ 4:خرپشته"},{"$f":"'وزن سازه فولادی'!L134","v":20.85},{"$f":"'وزن سازه فولادی'!S134","v":29}]
[null,null,null,null,null,null,null,null,null,null,null,null,null,null,null,null,null,null,null,null,null,null,null,null,null,null,null,null,null,null,null,null,null,null,null,null,null,2,"select"]
[null,null,null,null,"شماره طبقه",null,null,null,"بار مرده",null,null,null,null,null,"بار زنده",null,null,null,null,null,"درصد مشارکت یار زنده",null,null,null,null,null,"مجموع بار مرده و زنده",null,null,null,null,null,null,null,null,null,null,null,{"$f":"IF($AL$6=1,AM2,AJ2)","v":"تیپ 1:پارکینگ"},{"$f":"IF($AL$6=1,AN2,AK2)","v":174.25874999999999},{"$f":"IF($AL$6=1,AO2,AL2)","v":34.25}]
[null,null,null,null,"طبقه اول",null,null,null,{"$f":"CHOOSE(AJ8,$AN$7,$AN$8,$AN$9,$AN$10)","v":174.25874999999999},null,null,null,null,null,{"$f":"CHOOSE(AJ8,$AO$7,$AO$8,$AO$9,$AO$10)","v":34.25},null,null,null,null,null,0.2,null,null,null,null,null,{"$f":"I8+O8*U8","v":181.10874999999999},null,null,null,null,null,null,null,null,1,null,null,{"$f":"IF($AL$6=1,AM3,AJ3)","v":"تیپ 2:مسکونی"},183.01874999999998,34.25]
[null,null,null,null,"طبقه دوم",null,null,null,{"$f":"CHOOSE(AJ9,$AN$7,$AN$8,$AN$9,$AN$10)","v":183.01874999999998},null,null,null,null,null,{"$f":"CHOOSE(AJ9,$AO$7,$AO$8,$AO$9,$AO$10)","v":34.25},null,null,null,null,null,0.2,null,null,null,null,null,{"$f":"I9+O9*U9","v":189.86874999999998},null,null,null,null,null,null,null,null,2,null,null,"تیپ 3:بام",184.77374999999998,27]
[null,null,null,null,"طبقه سوم",null,null,null,183.01874999999998,null,null,null,null,null,34.25,null,null,null,null,null,0.2,null,null,null,null,null,189.86874999999998,null,null,null,null,null,null,null,null,2,null,null,"تیپ 4:خرپشته",28.925000000000004,2.25]
[null,null,null,null,"طبقه چهارم",null,null,null,183.01874999999998,null,null,null,null,null,34.25,null,null,null,null,null,0.2,null,null,null,null,null,189.86874999999998,null,null,null,null,null,null,null,null,2]
[null,null,null,null,"طبقه پنجم",null,null,null,183.01874999999998,null,null,null,null,null,34.25,null,null,null,null,null,0.2,null,null,null,null,null,189.86874999999998,null,null,null,null,null,null,null,null,2]
[null,null,null,null,"طبقه ششم",null,null,null,183.01874999999998,null,null,null,null,null,34.25,null,null,null,null,null,0.2,null,null,null,null,null,189.86874999999998,null,null,null,null,null,null,null,null,2]
[null,null,null,null,"طبقه هفتم",null,null,null,183.01874999999998,null,null,null,null,null,34.25,null,null,null,null,null,0.2,null,null,null,null,null,189.86874999999998,null,null,null,null,null,null,null,null,2]
[null,null,null,null,"طبقه هشتم",null,null,null,184.77374999999998,null,null,null,null,null,27,null,null,null,null,null,0.2,null,null,null,null,null,190.17374999999998,null,null,null,null,null,null,null,null,3]
[null,null,null,null,"خرپشته",null,null,null,28.925000000000004,null,null,null,null,null,2.25,null,null,null,null,null,0.2,null,null,null,null,null,29.375000000000004,null,null,null,null,null,null,null,null,4]
[null,null,null,null,null,null,null,null,null,null,null,null,null,null,null,null,null,null,null,null,"مجموع وزن سازه",null,null,null,null,null,{"$f":"AA8+AA9+AA10+AA11+AA12+AA13+AA14+AA15+AA16","v":1539.87}]
[]
[null,null,null,null,"ضریب زلزله در جهت X",null,null,null,null,null,null,null,null,null,null,null,null,null,"ضریب زلزله در جهت Y"]
[null,null,null,null,{"$f":"خلاصه!H29","v":0.11609999999999999},null,null,null,null,null,null,{"$f":"AA17*E20","v":178.77890699999998},null,null,null,null,null,null,{"$f":"خلاصه!D29","v":9.2700000000000005E-2},null,null,null,null,null,null,{"$f":"AA17*S20","v":142.745949}]
[]
[null,null,null,null,"توزیع نیروی برشی در جهت X"]
[null,null,null,null,"شماره طبقه",null,null,null,"وزن طبقه",null,null,null,null,"ارتفاع طبقه",null,null,null,"ارتفاع از تراز پایه",null,null,null,null,"Wi×Hi",null,null,null,null,"Fi"]
[null,null,null,null,"طبقه اول",null,null,null,{"$f":"AA8","v":181.10874999999999},null,null,null,null,2.8,null,null,null,{"$f":"N24","v":2.8},null,null,null,null,{"$f":"I24*R24","v":507.10449999999992},null,null,null,null,{"$f":"$L$20*W24/$W$32","v":4.1371709652438922}]
[null,null,null,null,"طبقه دوم",null,null,null,{"$f":"AA9","v":189.86874999999998},null,null,null,null,2.8,null,null,null,{"$f":"R24+N25","v":5.6},null,null,null,null,{"$f":"I25*R25","v":1063.2649999999999},null,null,null,null,{"$f":"$L$20*W25/$W$32","v":8.6745613307711658}]
[null,null,null,null,"طبقه سوم",null,null,null,189.86874999999998,null,null,null,null,3.5,null,null,null,{"$f":"R25+N26","v":9.1},null,null,null,null,1727.8056249999997,null,null,null,null,14.096162162503147]
[null,null,null,null,"طبقه چهارم",null,null,null,189.86874999999998,null,null,null,null,3.5,null,null,null,12.6,null,null,null,null,2392.3462499999996,null,null,null,null,19.517762994235124]
[null,null,null,null,"طبقه پنجم",null,null,null,189.86874999999998,null,null,null,null,3.5,null,null,null,16.100000000000001,null,null,null,null,3056.8868749999997,null,null,null,null,24.939363825967103]
[null,null,null,null,"طبقه ششم",null,null,null,189.86874999999998,null,null,null,null,3.5,null,null,null,19.600000000000001,null,null,null,null,3721.4274999999998,null,null,null,null,30.360964657699085]
[null,null,null,null,"طبقه هفتم",null,null,null,189.86874999999998,null,null,null,null,3.5,null,null,null,23.1,null,null,null,null,4385.9681249999994,null,null,null,null,35.782565489431065]
[null,null,null,null,"طبقه هشتم",null,null,null,190.17374999999998,null,null,null,null,3.5,null,null,null,26.6,null,null,null,null,5058.6217500000002,null,null,null,null,41.270355574149413]
[null,null,null,null,null,null,null,null,null,null,null,null,null,null,null,null,null,"ΣWi×Hi=",null,null,null,null,{"$f":"W24+W25+W26+W27+W28+W29+W30+W31","v":21913.425624999996},null,null,null,null,{"$f":"AB24+AB25+AB26+AB27+AB28+AB29+AB30+AB31","v":178.778907}]
[]
[]
[null,null,null,null,"توزیع نیروی برشی در جهت Y"]
[null,null,null,null,"شماره طبقه",null,null,null,"وزن طبقه",null,null,null,null,"ارتفاع طبقه",null,null,null,"ارتفاع از تراز پایه",null,null,null,null,"Wi×Hi",null,null,null,null,"Fi"]
[null,null,null,null,"طبقه اول",null,null,null,{"$f":"AA8","v":181.10874999999999},null,null,null,null,{"$f":"N24","v":2.8},null,null,null,{"$f":"N37","v":2.8},null,null,null,null,{"$f":"I37*R37","v":507.10449999999992},null,null,null,null,{"$f":"$Z$20*W37/$W$45","v":3.3033225536443478}]
[null,null,null,null,"طبقه دوم",null,null,null,{"$f":"AA9","v":189.86874999999998},null,null,null,null,{"$f":"N25","v":2.8},null,null,null,{"$f":"R37+N38","v":5.6},null,null,null,null,{"$f":"I38*R38","v":1063.2649999999999},null,null,null,null,{"$f":"$Z$20*W38/$W$45","v":6.9262001323211644}]
[null,null,null,null,"طبقه سوم",null,null,null,189.86874999999998,null,null,null,null,3.5,null,null,null,{"$f":"R38+N39","v":9.1},null,null,null,null,1727.8056249999997,null,null,null,null,11.255075215021892]
[null,null,null,null,"طبقه چهارم",null,null,null,189.86874999999998,null,null,null,null,3.5,null,null,null,12.6,null,null,null,null,2392.3462499999996,null,null,null,null,15.58395029772262]
[null,null,null,null,"طبقه پنجم",null,null,null,189.86874999999998,null,null,null,null,3.5,null,null,null,16.100000000000001,null,null,null,null,3056.8868749999997,null,null,null,null,19.912825380423349]
[null,null,null,null,"طبقه ششم",null,null,null,189.86874999999998,null,null,null,null,3.5,null,null,null,19.600000000000001,null,null,null,null,3721.4274999999998,null,null,null,null,24.241700463124079]
[null,null,null,null,"طبقه هفتم",null,null,null,189.86874999999998,null,null,null,null,3.5,null,null,null,23.1,null,null,null,null,4385.9681249999994,null,null,null,null,28.570575545824806]
[null,null,null,null,"طبقه هشتم",null,null,null,190.17374999999998,null,null,null,null,3.5,null,null,null,26.6,null,null,null,null,5058.6217500000002,null,null,null,null,32.95229941191775]
[null,null,null,null,null,null,null,null,null,null,null,null,null,null,null,null,null,"ΣWi×Hi=",null,null,null,null,{"$f":"W37+W38+W39+W40+W41+W42+W43+W44","v":21913.425624999996},null,null,null,null,{"$f":"AB37+AB38+AB39+AB40+AB41+AB42+AB43+AB44","v":142.745949}]
[]
[]
[]
[]
[null,null,null,null,"پخش نیروهای هر تراز بین قاب ها"]
[null,null,null,null,"در جهت X",null,null,null,null,null,null,null,null,null,null,null,null,null,"در جهت Y"]
[null,null,null,null,"سهم قاب مورد نظر از نیروی جانبی (درصد)",null,null,null,null,null,null,null,null,null,null,0.2,null,null,"سهم قاب مورد نظر از نیروی جانبی (درصد)",null,null,null,null,null,null,null,null,null,null,0.3]
[]
[null,null,null,null,"شماره طبقه",null,null,null,"نیرو در جهت X",null,null,null,null,null,"نیرو در جهت Y",null,null,null,null,null,"نیروی جانبی در جهت X",null,null,null,null,null,"نیروی جانبی در جهت Y"]
[null,null,null,null,"طبقه اول",null,null,null,{"$f":"AB24","v":4.1371709652438922},null,null,null,null,null,{"$f":"AB37","v":3.3033225536443478},null,null,null,null,null,{"$f":"I55*$P$52","v":0.82743419304877852},null,null,null,null,null,{"$f":"O55*$AD$52","v":0.99099676609330434}]
[null,null,null,null,"طبقه دوم",null,null,null,{"$f":"AB25","v":8.6745613307711658},null,null,null,null,null,{"$f":"AB38","v":6.9262001323211644},null,null,null,null,null,{"$f":"I56*$P$52","v":1.7349122661542333},null,null,null,null,null,{"$f":"O56*$AD$52","v":2.0778600396963491}]
[null,null,null,null,"طبقه سوم",null,null,null,14.096162162503147,null,null,null,null,null,11.255075215021892,null,null,null,null,null,2.8192324325006295,null,null,null,null,null,3.3765225645065673]
[null,null,null,null,"طبقه چهارم",null,null,null,19.517762994235124,null,null,null,null,null,15.58395029772262,null,null,null,null,null,3.9035525988470248,null,null,null,null,null,4.6751850893167859]
[null,null,null,null,"طبقه پنجم",null,null,null,24.939363825967103,null,null,null,null,null,19.912825380423349,null,null,null,null,null,4.9878727651934209,null,null,null,null,null,5.9738476141270045]
[null,null,null,null,"طبقه ششم",null,null,null,30.360964657699085,null,null,null,null,null,24.241700463124079,null,null,null,null,null,6.0721929315398171,null,null,null,null,null,7.2725101389372231]
[null,null,null,null,"طبقه هفتم",null,null,null,35.782565489431065,null,null,null,null,null,28.570575545824806,null,null,null,null,null,7.1565130978862133,null,null,null,null,null,8.5711726637474417]
[null,null,null,null,"طبقه هشتم",null,null,null,41.270355574149413,null,null,null,null,null,32.95229941191775,null,null,null,null,null,8.2540711148298822,null,null,null,null,null,9.8856898235753246]
[]
[null,null,null,null,"محاسبه لنگر واژگونی در جهت X"]
[null,null,null,null,"شماره طبقه",null,null,null,"ارتفاع طبقه",null,null,null,null,null,"ارتفاع از تراز پابه",null,null,null,null,null,"Fi",null,null,null,null,null,"Fi × Hi"]
[null,null,null,null,"طبقه اول",null,null,null,{"$f":"N24","v":2.8},null,null,null,null,null,{"$f":"I66","v":2.8},null,null,null,null,null,{"$f":"AB24","v":4.1371709652438922},null,null,null,null,null,{"$f":"O66*U66","v":11.584078702682897}]
[null,null,null,null,"طبقه دوم",null,null,null,{"$f":"N25","v":2.8},null,null,null,null,null,{"$f":"O66+I67","v":5.6},null,null,null,null,null,{"$f":"AB25","v":8.6745613307711658},null,null,null,null,null,{"$f":"O67*U67","v":48.577543452318523}]
[null,null,null,null,"طبقه سوم",null,null,null,3.5,null,null,null,null,null,{"$f":"O67+I68","v":9.1},null,null,null,null,null,14.096162162503147,null,null,null,null,null,128.27507567877862]
[null,null,null,null,"طبقه چهارم",null,null,null,3.5,null,null,null,null,null,12.6,null,null,null,null,null,19.517762994235124,null,null,null,null,null,245.92381372736256]
[null,null,null,null,"طبقه پنجم",null,null,null,3.5,null,null,null,null,null,16.100000000000001,null,null,null,null,null,24.939363825967103,null,null,null,null,null,401.5237575980704]
[null,null,null,null,"طبقه ششم",null,null,null,3.5,null,null,null,null,null,19.600000000000001,null,null,null,null,null,30.360964657699085,null,null,null,null,null,595.07490729090216]
[null,null,null,null,"طبقه هفتم",null,null,null,3.5,null,null,null,null,null,23.1,null,null,null,null,null,35.782565489431065,null,null,null,null,null,826.57726280585769]
[null,null,null,null,"طبقه هشتم",null,null,null,3.5,null,null,null,null,null,26.6,null,null,null,null,null,41.270355574149413,null,null,null,null,null,1097.7914582723745]
[null,null,null,null,null,null,null,null,null,null,null,null,null,null,null,null,null,null,null,null,"Σ=",null,null,null,null,null,{"$f":"AA66+AA67+AA68+AA69+AA70+AA71+AA72+AA73","v":3355.3278975283474}]
[]
[null,null,null,null,"محاسبه لنگر مقاوم در جهت X",null,null,null,null,null,null,null,"وزن سازه",null,null,null,null,"مرکز سطح  X",null,null,null,null,"Mrx",null,null,null,null,{"$f":"IF(W77/AA74>=1.75,\"OK\",\"N.OK\")","v":"OK"}]
[null,null,null,null,null,null,null,null,null,null,null,null,{"$f":"AA17","v":1539.87},null,null,null,null,4.1500000000000004,null,null,null,null,{"$f":"M77*R77","v":6390.4605000000001}]
[]
[null,null,null,null,"محاسبه لنگر واژگونی در جهت Y"]
[null,null,null,null,"شماره طبقه",null,null,null,"ارتفاع طبقه",null,null,null,null,null,"ارتفاع از تراز پابه",null,null,null,null,null,"Fi",null,null,null,null,null,"Fi × Hi"]
[null,null,null,null,"طبقه اول",null,null,null,{"$f":"N24","v":2.8},null,null,null,null,null,{"$f":"I81","v":2.8},null,null,null,null,null,{"$f":"AB37","v":3.3033225536443478},null,null,null,null,null,{"$f":"O81*U81","v":9.2493031502041738}]
[null,null,null,null,"طبقه دوم",null,null,null,{"$f":"N25","v":2.8},null,null,null,null,null,{"$f":"O81+I82","v":5.6},null,null,null,null,null,{"$f":"AB38","v":6.9262001323211644},null,null,null,null,null,{"$f":"O82*U82","v":38.786720740998518}]
[null,null,null,null,"طبقه سوم",null,null,null,3.5,null,null,null,null,null,{"$f":"O82+I83","v":9.1},null,null,null,null,null,11.255075215021892,null,null,null,null,null,102.42118445669921]
[null,null,null,null,"طبقه چهارم",null,null,null,3.5,null,null,null,null,null,12.6,null,null,null,null,null,15.58395029772262,null,null,null,null,null,196.35777375130499]
[null,null,null,null,"طبقه پنجم",null,null,null,3.5,null,null,null,null,null,16.100000000000001,null,null,null,null,null,19.912825380423349,null,null,null,null,null,320.59648862481595]
[null,null,null,null,"طبقه ششم",null,null,null,3.5,null,null,null,null,null,19.600000000000001,null,null,null,null,null,24.241700463124079,null,null,null,null,null,475.13732907723198]
[null,null,null,null,"طبقه هفتم",null,null,null,3.5,null,null,null,null,null,23.1,null,null,null,null,null,28.570575545824806,null,null,null,null,null,659.98029510855304]
[null,null,null,null,"طبقه هشتم",null,null,null,3.5,null,null,null,null,null,26.6,null,null,null,null,null,32.95229941191775,null,null,null,null,null,876.53116435701224]
[null,null,null,null,null,null,null,null,null,null,null,null,null,null,null,null,null,null,null,null,"Σ=",null,null,null,null,null,{"$f":"AA81+AA82+AA83+AA84+AA85+AA86+AA87+AA88","v":2679.0602592668201}]
[]
[null,null,null,null,"محاسبه لنگر مقاوم در جهت Y",null,null,null,null,null,null,null,"وزن سازه",null,null,null,null,"مرکز سطح  Y",null,null,null,null,"Mry",null,null,null,null,{"$f":"IF(W92/AA89>=1.75,\"OK\",\"N.OK\")","v":"OK"}]
[null,null,null,null,null,null,null,null,null,null,null,null,{"$f":"AA17","v":1539.87},null,null,null,null,7.2,null,null,null,null,{"$f":"M92*R92","v":11087.064}]
[]
[]
[]
[]
[null,null,null,null,null,null,{"$f":"U62","v":8.2540711148298822},null,null,null,null,"8 st"]
[]
[]
[null,null,null,null,null,null,{"$f":"U61","v":7.1565130978862133},null,null,null,null,"7 st"]
[]
[]
[null,null,null,null,null,null,{"$f":"U60","v":6.0721929315398171},null,null,null,null," 6 st"]
[]
[]
[null,null,null,null,null,null,{"$f":"U59","v":4.9878727651934209},null,null,null,null,"5 st"]
[]
[]
[null,null,null,null,null,null,{"$f":"U58","v":3.9035525988470248},null,null,null,null,"4 st"]
[]
[]
[null,null,null,null,null,null,{"$f":"U57","v":2.8192324325006295},null,null,null,null,"3 st"]
[]
[]
[null,null,null,null,null,null,{"$f":"U56","v":1.7349122661542333},null,null,null,null,"2 st"]
[]
[]
[null,null,null,null,null,null,{"$f":"U55","v":0.82743419304877852},null,null,null,null,"1 st"]
[]
[]
[]
[null,null,null,null,null,null,{"$f":"AA62","v":9.8856898235753246},null,null,null,null,"8 st"]
[]
[]
[null,null,null,null,null,null,{"$f":"AA61","v":8.5711726637474417},null,null,null,null,"7 st"]
[]
[]
[null,null,null,null,null,null,{"$f":"AA60","v":7.2725101389372231},null,null,null,null," 6 st"]
[]
[]
[null,null,null,null,null,null,{"$f":"AA59","v":5.9738476141270045},null,null,null,null,"5 st"]
[]
[]
[null,null,null,null,null,null,{"$f":"AA58","v":4.6751850893167859},null,null,null,null,"4 st"]
[]
[]
[null,null,null,null,null,null,{"$f":"AA57","v":3.3765225645065673},null,null,null,null,"3 st"]
[]
[]
[null,null,null,null,null,null,{"$f":"AA56","v":2.0778600396963491},null,null,null,null,"2 st"]
[]
[]
[null,null,null,null,null,null,{"$f":"AA55","v":0.99099676609330434},null,null,null,null,"1 st"]